Silacyclobutane,1-chloro-1-methyl-
- Formula: C4H9ClSi
- Molecular weight: 120.653
- IUPAC Standard InChIKey: JWKKXHBGWAQZOK-UHFFFAOYSA-N
- CAS Registry Number: 2351-34-0
- Chemical structure:
View 3d structure (requires JavaScript / HTML 5) - Permanent link for this species. Use this link for bookmarking this species for future reference.

Gas phase ion energetics data

Data compiled by: Sharon G. Lias, Rhoda D. Levin, and Sherif A. Kafafi
Ionization energy determinations
IE (eV) | Method | Reference | Comment |
---|---|---|---|
9.95 | PE | Cundy, Lappert, et al., 1973 | Vertical value |

References

Cundy, Lappert, et al., 1973
Cundy, C.S.; Lappert, M.F.; Pedley, J.B.; Schmidt, W.; Wilkins, B.T.,
Bonding studies of compounds of boron and the Group IV elements. XI. Photoelectron spectra of strained cyclic organosilicon compounds,
J. Organomet. Chem., 1973, 51, 99. [all data]