Silacyclobutane, 1,1-dichloro-
- Formula: C3H6Cl2Si
- Molecular weight: 141.071
- IUPAC Standard InChIKey: PASYEMKYRSIVTP-UHFFFAOYSA-N
- CAS Registry Number: 2351-33-9
- Chemical structure:
View 3d structure (requires JavaScript / HTML 5) - Other names: 1,1-Dichlorosilacyclobutane; Cyclotrimethylenedichlorosilane

Gas phase ion energetics data

Data compiled by: Sharon G. Lias, Rhoda D. Levin, and Sherif A. Kafafi
Ionization energy determinations
IE (eV) | Method | Reference | Comment |
---|---|---|---|
10.50 | PE | Cundy, Lappert, et al., 1973 | Vertical value |

References

Cundy, Lappert, et al., 1973
Cundy, C.S.; Lappert, M.F.; Pedley, J.B.; Schmidt, W.; Wilkins, B.T.,
Bonding studies of compounds of boron and the Group IV elements. XI. Photoelectron spectra of strained cyclic organosilicon compounds,
J. Organomet. Chem., 1973, 51, 99. [all data]