Ethyl radical, 1-hydroxy
- Formula: C2H5O
- Molecular weight: 45.0605
- IUPAC Standard InChIKey: GAWIXWVDTYZWAW-UHFFFAOYSA-N
- CAS Registry Number: 2348-46-1
- Chemical structure:

Gas phase ion energetics data

Data evaluated as indicated in comments:
HL - Edward P. Hunter and Sharon G. Lias
Data compiled as indicated in comments:
LL - Sharon G. Lias and Joel F. Liebman
Quantity | Value | Units | Method | Reference | Comment |
---|---|---|---|---|---|
Proton affinity (review) | 720.1 | kJ/mol | N/A | Hunter and Lias, 1998 | HL |
Quantity | Value | Units | Method | Reference | Comment |
Gas basicity | 687.7 | kJ/mol | N/A | Hunter and Lias, 1998 | HL |
Ionization energy determinations
IE (eV) | Method | Reference | Comment |
---|---|---|---|
≤6.85 | PI | Ruscic and Berkowitz, 1994 | LL |
6.7 | DER | Lias, Bartmess, et al., 1988 | LL |

References

Hunter and Lias, 1998
Hunter, E.P.; Lias, S.G.,
Evaluated Gas Phase Basicities and Proton Affinities of Molecules: An Update,
J. Phys. Chem. Ref. Data, 1998, 27, 3, 413-656, https://doi.org/10.1063/1.556018
. [all data]
Ruscic and Berkowitz, 1994
Ruscic, B.; Berkowitz, J.,
The heats of formation of some C2H5O+ isomers, relevant bond energies in ethanol and PA(CH3CHO),
J. Chem. Phys., 1994, 101, 10936. [all data]
Lias, Bartmess, et al., 1988
Lias, S.G.; Bartmess, J.E.; Liebman, J.F.; Holmes, J.L.; Levin, R.D.; Mallard, W.G.,
Gas-phase ion and neutral thermochemistry,
J. Phys. Chem. Ref. Data, Suppl. 1, 1988, 17, 1-861. [all data]