Benzoic acid, 4-(acetyloxy)-
- Formula: C9H8O4
- Molecular weight: 180.1574
- IUPAC Standard InChIKey: GDBUZIKSJGRBJP-UHFFFAOYSA-N
- CAS Registry Number: 2345-34-8
- Chemical structure:
View 3d structure (requires JavaScript / HTML 5) - Other names: 4-Acetoxybenzoic acid; O-Acetyl-p-hydroxybenzoic acid; p-Acetoxybenzoic acid; p-Acetyloxybenzoic acid; p-Carboxyphenyl acetate; p-Hydroxybenzoic acid acetate; Benzoic acid, p-hydroxy-, acetate; 4-Carboxyphenyl acetate; 4-Acetate-benzoic acid; NSC 11340

Phase change data

Data compiled by: William E. Acree, Jr., James S. Chickos
Enthalpy of fusion
ΔfusH (kJ/mol) | Temperature (K) | Reference |
---|---|---|
26.35 | 467.2 | YUAN, ZHANG, et al., 1997 |

Reaction thermochemistry data

Data compiled by: Hussein Y. Afeefy, Joel F. Liebman, and Stephen E. Stein
Individual Reactions
By formula: C9H8O4 + H2O = C2H4O2 + C7H6O3
Quantity | Value | Units | Method | Reference | Comment |
---|---|---|---|---|---|
ΔrH° | -20.6 ± 0.3 | kJ/mol | Cm | Nelander, 1964 | solid phase; Heat of hydrolysis |

Gas phase ion energetics data

Data compiled by: Sharon G. Lias, Rhoda D. Levin, and Sherif A. Kafafi
Ionization energy determinations
IE (eV) | Method | Reference |
---|---|---|
9.1 ± 0.2 | EI | Gamble, Gilbert, et al., 1971 |
Appearance energy determinations
Ion | AE (eV) | Other Products | Method | Reference | Comment |
---|---|---|---|---|---|
C2H3O+ | 12.5 ± 0.2 | C6H4(COOH) | EI | Gamble, Gilbert, et al., 1971 | |
C7H6O3+ | 10.1 ± 0.2 | CH2=C=O | EI | Gamble, Gilbert, et al., 1971 |

References

YUAN, ZHANG, et al., 1997
YUAN, JING; ZHANG, GUANG-LI; HUANG, DI-YUN,
Mesomorphic behaviour of 4-benzoyloxybenzoic acid and its binary mixture with 4-acetoxybenzoic acid,
Liquid Crystals, 1997, 22, 6, 693-696, https://doi.org/10.1080/026782997208794
. [all data]
Nelander, 1964
Nelander, L.,
The heats of hydrolysis of aspirin, thioaspirin, and their p-analogues,
Acta Chem. Scand., 1964, 18, 973-984. [all data]
Gamble, Gilbert, et al., 1971
Gamble, A.A.; Gilbert, J.R.; Tillett, J.G.,
Substituent effects on the mass spectra of substituted phenyl acetates,
Org. Mass Spectrom., 1971, 5, 1093. [all data]