Molybdenum tetrafluoride
- Formula: F4Mo
- Molecular weight: 171.95
- CAS Registry Number: 23412-45-5

Gas phase thermochemistry data

Quantity | Value | Units | Method | Reference | Comment |
---|---|---|---|---|---|
ΔfH°gas | -947.68 | kJ/mol | Review | Chase, 1998 | Data last reviewed in December, 1978 |
Quantity | Value | Units | Method | Reference | Comment |
S°gas,1 bar | 328.93 | J/mol*K | Review | Chase, 1998 | Data last reviewed in December, 1978 |
Gas Phase Heat Capacity (Shomate Equation)
Cp° = A + B*t + C*t2 + D*t3 +
E/t2
H° − H°298.15= A*t + B*t2/2 +
C*t3/3 + D*t4/4 − E/t + F − H
S° = A*ln(t) + B*t + C*t2/2 + D*t3/3 −
E/(2*t2) + G
Cp = heat capacity (J/mol*K)
H° = standard enthalpy (kJ/mol)
S° = standard entropy (J/mol*K)
t = temperature (K) / 1000.
View plot Requires a JavaScript / HTML 5 canvas capable browser.
Temperature (K) | 298. to 1300. | 1300. to 6000. |
---|---|---|
A | 80.13824 | 126.7154 |
B | 63.50308 | -15.77548 |
C | -53.72925 | 4.422781 |
D | 15.85916 | -0.327195 |
E | -0.847072 | -11.66089 |
F | -976.7925 | -1009.704 |
G | 404.4585 | 454.8134 |
H | -947.6760 | -947.6760 |
Reference | Chase, 1998 | Chase, 1998 |
Comment | Data last reviewed in December, 1978 | Data last reviewed in December, 1978 |

Gas phase ion energetics data

Data compiled as indicated in comments:
LLK - Sharon G. Lias, Rhoda D. Levin, and Sherif A. Kafafi
B - John E. Bartmess
Electron affinity determinations
EA (eV) | Method | Reference | Comment |
---|---|---|---|
<2.28095 | TDEq | Borshchevskii, Boltalina, et al., 1988 | B |
Ionization energy determinations
IE (eV) | Method | Reference | Comment |
---|---|---|---|
9.7 ± 0.2 | EI | Alikhanyan, Steblevskii, et al., 1978 | LLK |
10.11 ± 0.10 | EI | Hildenbrand, 1976 | LLK |
Appearance energy determinations
Ion | AE (eV) | Other Products | Method | Reference | Comment |
---|---|---|---|---|---|
F2Mo+ | 19.0 ± 1.0 | ? | EI | Alikhanyan, Steblevskii, et al., 1978 | LLK |
F3Mo+ | 14.0 ± 0.5 | F | EI | Alikhanyan, Steblevskii, et al., 1978 | LLK |

Reaction thermochemistry data

Data compiled by: John E. Bartmess

Individual Reactions

Fluorine anion + F4Mo = (Fluorine anion • F4Mo)

By formula: F- + F4Mo = (F- • F4Mo)

Quantity Value Units Method Reference Comment
Δr383. ± 14.kJ/molTDEqBorshchevskii, Boltalina, et al., 1988gas phase; value altered from reference due to conversion from electron convention to ion convention
Δr384. ± 17.kJ/molTDEqBorchevsky and Sidorov, 1985gas phase; Fluoride Affinity: MoF4 > UF4 by 7.1 kcal/mol; value altered from reference due to conversion from electron convention to ion convention

Ion clustering data

Data compiled by: John E. Bartmess

Clustering reactions

Fluorine anion + F4Mo = (Fluorine anion • F4Mo)

By formula: F- + F4Mo = (F- • F4Mo)

Quantity Value Units Method Reference Comment
Δr91.5 ± 3.3kcal/molTDEqBorshchevskii, Boltalina, et al., 1988gas phase; value altered from reference due to conversion from electron convention to ion convention
Δr91.8 ± 4.0kcal/molTDEqBorchevsky and Sidorov, 1985gas phase; Fluoride Affinity: MoF4 > UF4 by 7.1 kcal/mol; value altered from reference due to conversion from electron convention to ion convention

References

Chase, 1998
Chase, M.W., Jr.,
NIST-JANAF Themochemical Tables, Fourth Edition,
J. Phys. Chem. Ref. Data, Monograph 9, 1998, 1-1951. [all data]
Borshchevskii, Boltalina, et al., 1988
Borshchevskii, A.Ya.; Boltalina, O.V.; Sorokin, I.D.; Sidorov, L.N.,
Thermochemical Quantities for Gas Phase Iron, Uranium, and Molybdenum Fluorides, and Their Negative Ions.,
J. Chem. Thermodyn., 1988, 20, 5, 523, https://doi.org/10.1016/0021-9614(88)90080-8
. [all data]
Alikhanyan, Steblevskii, et al., 1978
Alikhanyan, A.S.; Steblevskii, A.V.; Malkerova, I.P.; Pervov, V.S.; Butskii, V.D.; Gorgoraki, V.I.,
Mass spectrometric study of the sublimation of molybdenum trifluoride,
Russ. J. Inorg. Chem., 1978, 23, 814. [all data]
Hildenbrand, 1976
Hildenbrand, D.L.,
Thermochemical studies of the gaseous lower valent fluorides of molybdenum,
J. Chem. Phys., 1976, 65, 614. [all data]