Acetamide, N-(2,4-dibromophenyl)-
- Formula: C8H7Br2NO
- Molecular weight: 292.955
- IUPAC Standard InChIKey: AIDNLFKPDZOXHF-UHFFFAOYSA-N
- CAS Registry Number: 23373-04-8
- Chemical structure:
View 3d structure (requires JavaScript / HTML 5) - Other names: 2',4'-dibromoacetanilide

Gas phase ion energetics data

Data compiled by: Sharon G. Lias, Rhoda D. Levin, and Sherif A. Kafafi
Ionization energy determinations
IE (eV) | Method | Reference |
---|---|---|
8.08 ± 0.03 | EI | Benezra and Bursey, 1972 |
Appearance energy determinations
Ion | AE (eV) | Other Products | Method | Reference | Comment |
---|---|---|---|---|---|
C2H3O+ | 13.10 ± 0.03 | ? | EI | Benezra and Bursey, 1972 | |
C6H5NBr2+ | 10.24 ± 0.03 | CH2=C=O | EI | Benezra and Bursey, 1972 | |
C8H7NOBr+ | 8.84 ± 0.03 | ? | EI | Benezra and Bursey, 1972 |

References

Benezra and Bursey, 1972
Benezra, S.A.; Bursey, M.M.,
ortho-Effects in mass spectra. Alteration of the molecular-ion energy distribution in disubstituted acetanilides,
Z. Naturforsch. A:, 1972, 27, 670. [all data]