(Z)-Diisopropyldiazene
- Formula: C6H14N2
- Molecular weight: 114.1888
- IUPAC Standard InChIKey: BXCOOPLIKAAONJ-FPLPWBNLSA-N
- CAS Registry Number: 23201-84-5
- Chemical structure:
View 3d structure (requires JavaScript / HTML 5) - Stereoisomers:

Gas phase ion energetics data

Data compiled as indicated in comments:
LLK - Sharon G. Lias, Rhoda D. Levin, and Sherif A. Kafafi
Ionization energy determinations
IE (eV) | Method | Reference | Comment |
---|---|---|---|
8.24 | PE | Houk, Chang, et al., 1975 | Vertical value; LLK |

References

Houk, Chang, et al., 1975
Houk, K.N.; Chang, Y.-M.; Engel, P.S.,
Photoelectron spectroscopy of azo compounds,
J. Am. Chem. Soc., 1975, 97, 1824. [all data]