(2.2)Metacyclophane
- Formula: C16H16
- Molecular weight: 208.2982
- IUPAC Standard InChIKey: COTONUHLIMVDNV-UHFFFAOYSA-N
- CAS Registry Number: 2319-97-3
- Chemical structure:
View 3d structure (requires JavaScript / HTML 5) - Other names: Tricyclo[9.3.1.1<sup>4,8</sup>]hexadeca-1(15),4,6,8(16),11,13-hexaene; Di-m-xylylene; Di-1,3-xylylene; Tricyclo(9.3.1.14,8)hexadeca-1(15),4,6,8(16),11,13-hexaene; Triple-layered-(2.2)metacyclophane

Gas phase thermochemistry data

Data compiled by: Hussein Y. Afeefy, Joel F. Liebman, and Stephen E. Stein
Quantity | Value | Units | Method | Reference | Comment |
---|---|---|---|---|---|
ΔfH°gas | 170. ± 7.9 | kJ/mol | Ccb | Shieh, McNally, et al., 1969 |

Condensed phase thermochemistry data

Data compiled as indicated in comments:
ALS - Hussein Y. Afeefy, Joel F. Liebman, and Stephen E. Stein
DH - Eugene S. Domalski and Elizabeth D. Hearing
Quantity | Value | Units | Method | Reference | Comment |
---|---|---|---|---|---|
ΔfH°solid | 78.2 ± 6.3 | kJ/mol | Ccb | Shieh, McNally, et al., 1969 | ALS |
Quantity | Value | Units | Method | Reference | Comment |
ΔcH°solid | -8661.3 ± 6.3 | kJ/mol | Ccb | Shieh, McNally, et al., 1969 | Corresponding ΔfHºsolid = 78.7 kJ/mol (simple calculation by NIST; no Washburn corrections); ALS |
Constant pressure heat capacity of solid
Cp,solid (J/mol*K) | Temperature (K) | Reference | Comment |
---|---|---|---|
240.6 | 300. | Shieh, McNally, et al., 1969 | T = 300, 318 K.; DH |

Phase change data

Data compiled as indicated in comments:
ALS - Hussein Y. Afeefy, Joel F. Liebman, and Stephen E. Stein
DRB - Donald R. Burgess, Jr.
AC - William E. Acree, Jr., James S. Chickos
Quantity | Value | Units | Method | Reference | Comment |
---|---|---|---|---|---|
ΔsubH° | 92. ± 2. | kJ/mol | V | Shieh, McNally, et al., 1969 | ALS |
ΔsubH° | 91.8 | kJ/mol | N/A | Shieh, McNally, et al., 1969 | DRB |
ΔsubH° | 92. ± 2. | kJ/mol | ME | Shieh, McNally, et al., 1969 | See also Pedley and Rylance, 1977.; AC |
Enthalpy of sublimation
ΔsubH (kJ/mol) | Temperature (K) | Method | Reference | Comment |
---|---|---|---|---|
91.6 ± 1.7 | 320. | ME | Shieh, McNally, et al., 1969 | Based on data from 308. to 332. K. See also Pedley and Rylance, 1977 and Stephenson and Malanowski, 1987.; AC |
Enthalpy of fusion
ΔfusH (kJ/mol) | Temperature (K) | Reference | Comment |
---|---|---|---|
21.42 | 404. | Shieh, McNally, et al., 1969 | AC |

Gas phase ion energetics data

Data compiled as indicated in comments:
LLK - Sharon G. Lias, Rhoda D. Levin, and Sherif A. Kafafi
Ionization energy determinations
IE (eV) | Method | Reference | Comment |
---|---|---|---|
8.20 | PE | Kovac, Allan, et al., 1980 | Vertical value; LLK |
8.24 | PE | Koenig, Tuttle, et al., 1974 | Vertical value; LLK |
8.24 | PE | Boschi and Schmidt, 1973 | Vertical value; LLK |

References

Shieh, McNally, et al., 1969
Shieh, C.; McNally, D.; Boyd, R.H.,
The heats of combustion and strain energies of some cyclophanes,
Tetrahedron, 1969, 3653-3665. [all data]
Pedley and Rylance, 1977
Pedley, J.B.; Rylance, J.,
, Computer Analysed Thermochemical Data: Organic and Organometallic Compounds, University of Sussex, Brighton, 1977. [all data]
Stephenson and Malanowski, 1987
Stephenson, Richard M.; Malanowski, Stanislaw,
Handbook of the Thermodynamics of Organic Compounds, 1987, https://doi.org/10.1007/978-94-009-3173-2
. [all data]
Kovac, Allan, et al., 1980
Kovac, B.; Allan, M.; Heilbronner, E.; Maier, J.P.; Gleiter, R.; Haenel, M.W.; Keehn, P.M.; Reiss, J.A.,
He(Iα) photoelectron spectra of [2.2]cyclophanes,
J. Electron Spectrosc. Relat. Phenom., 1980, 19, 167. [all data]
Koenig, Tuttle, et al., 1974
Koenig, T.; Tuttle, M.; Wielesek, R.A.,
The He(I) photoelectron spectra of xylenes and metacyclophanes. A reassignment of the lowest ionic state of [2.2] metacyclophane,
Tetrahedron Lett., 1974, 2537. [all data]
Boschi and Schmidt, 1973
Boschi, R.; Schmidt, W.,
Transannular π - π interaction in cyclophanes,
Angew. Chem. Int. Ed. Engl., 1973, 12, 402. [all data]