Ethene, 1-chloro-1-fluoro-
- Formula: C2H2ClF
- Molecular weight: 80.489
- IUPAC Standard InChIKey: FPBWSPZHCJXUBL-UHFFFAOYSA-N
- CAS Registry Number: 2317-91-1
- Chemical structure:
View 3d structure (requires JavaScript / HTML 5) - Other names: Ethylene, 1-chloro-1-fluoro-; 1-Chloro-1-fluoroethylene; CH2=CFCl

Phase change data

Data compiled as indicated in comments:
BS - Robert L. Brown and Stephen E. Stein
TRC - Thermodynamics Research Center, NIST Boulder Laboratories, Chris Muzny director
Quantity | Value | Units | Method | Reference | Comment |
---|---|---|---|---|---|
Tboil | 249. | K | N/A | PCR Inc., 1990 | BS |
Tboil | 249. | K | N/A | Tornow, Locht, et al., 1990 | Uncertainty assigned by TRC = 1.5 K; TRC |

Gas phase ion energetics data

Data compiled by: Sharon G. Lias, Rhoda D. Levin, and Sherif A. Kafafi
Ionization energy determinations
IE (eV) | Method | Reference |
---|---|---|
10.7 ± 0.2 | EI | Syrvatka, Gil'burd, et al., 1972 |
9.97 | S | Scott and Russell, 1972 |
10.7 ± 0.2 | EI | Syrvatka, Bel'ferman, et al., 1971 |
Appearance energy determinations
Ion | AE (eV) | Other Products | Method | Reference | Comment |
---|---|---|---|---|---|
CFCl+ | 16.8 ± 0.1 | CH2 | EI | Syrvatka, Bel'ferman, et al., 1971 | |
C2HFCl+ | 16.2 ± 0.2 | H | EI | Syrvatka, Gil'burd, et al., 1972 | |
C2H2Cl+ | 14.8 ± 0.1 | F | EI | Syrvatka, Gil'burd, et al., 1972 | |
C2H2F+ | 13.7 ± 0.1 | Cl | EI | Syrvatka, Gil'burd, et al., 1972 |

References

PCR Inc., 1990
PCR Inc.,
Research Chemicals Catalog 1990-1991, PCR Inc., Gainesville, FL, 1990, 1. [all data]
Tornow, Locht, et al., 1990
Tornow, G.; Locht, R.; Kaufel, R.; Baumgaertel, H.; Jochims, H.W.,
The vacuum ultraviolet photoabsorption and photoelectron spectroscopy of fluorochloroethenes. The 1,1-, cis- and trans-fluorochloroethene,
Chem. Phys., 1990, 146, 115-28. [all data]
Syrvatka, Gil'burd, et al., 1972
Syrvatka, B.G.; Gil'burd, M.M.; Bel'ferman, A.L.,
Mass spectrometric study of chlorofluoro-substituted ethylenes,
J. Org. Chem. USSR, 1972, 8, 1587, In original 1553. [all data]
Scott and Russell, 1972
Scott, J.D.; Russell, B.R.,
Vacuum-ultraviolet spectral studies of several chlorofluoroethylenes,
J. Am. Chem. Soc., 1972, 94, 2634. [all data]
Syrvatka, Bel'ferman, et al., 1971
Syrvatka, B.G.; Bel'ferman, A.L.; Gil'burd, M.M.; Moin, F.B.,
Determination of the dissociation energy of the double bond in some fluorochloro-substituted ethylenes and their ions by electron bombardment,
J. Org. Chem. USSR, 1971, 7, 8, In original 9. [all data]