n-Propyl benzoate
- Formula: C10H12O2
- Molecular weight: 164.2011
- IUPAC Standard InChIKey: UDEWPOVQBGFNGE-UHFFFAOYSA-N
- CAS Registry Number: 2315-68-6
- Chemical structure:
View 3d structure (requires JavaScript / HTML 5) - Other names: Propyl benzoate; Benzoic acid n-propyl ester; Benzoic acid, propyl ester; Benzoate de propyle; Propyl benzenecarboxylate

Phase change data

Data compiled as indicated in comments:
BS - Robert L. Brown and Stephen E. Stein
TRC - Thermodynamics Research Center, NIST Boulder Laboratories, Chris Muzny director
AC - William E. Acree, Jr., James S. Chickos
Quantity | Value | Units | Method | Reference | Comment |
---|---|---|---|---|---|
Tboil | 503.7 ± 0.9 | K | AVG | N/A | Average of 6 values; Individual data points |
Reduced pressure boiling point
Tboil (K) | Pressure (bar) | Reference | Comment |
---|---|---|---|
502.7 | 1.02 | Aldrich Chemical Company Inc., 1990 | BS |
Enthalpy of vaporization
ΔvapH (kJ/mol) | Temperature (K) | Method | Reference | Comment |
---|---|---|---|---|
60.2 | 379. | BG | Katayama, 1988 | Based on data from 359. to 458. K.; AC |
52.7 | 440. | BG | Katayama, 1988 | Based on data from 359. to 458. K.; AC |
53.8 | 342. | A | Stephenson and Malanowski, 1987 | Based on data from 327. to 504. K. See also Stull, 1947.; AC |
Antoine Equation Parameters
log10(P) = A − (B / (T + C))
P = vapor pressure (bar)
T = temperature (K)
View plot Requires a JavaScript / HTML 5 canvas capable browser.
Temperature (K) | A | B | C | Reference | Comment |
---|---|---|---|---|---|
327.8 to 504. | 4.71837 | 2185.719 | -39.467 | Stull, 1947 | Coefficents calculated by NIST from author's data. |

Gas phase ion energetics data

Data compiled by: Sharon G. Lias, Rhoda D. Levin, and Sherif A. Kafafi
Appearance energy determinations
Ion | AE (eV) | Other Products | Method | Reference | Comment |
---|---|---|---|---|---|
C6H5+ | 14.9 ± 0.06 | ? | EI | Tajima, Azami, et al., 1977 | |
C7H5O+ | 11.2 ± 0.05 | OC3H7 | EI | Tajima, Azami, et al., 1977 |

Kovats' RI, non-polar column, isothermal

View large format table.

Column type Active phase Temperature (C) I Reference Comment
CapillaryDB-1170.1266.05Mijin and Antonovic, 200630. m/0.256 mm/0.25 μm, N2
CapillaryDB-5170.1287.24Mijin and Antonovic, 200660. m/0.321 mm/0.25 μm, N2
CapillarySE-30160.1249.Korhonen, 1986N2; Column length: 25. m; Column diameter: 0.33 mm
CapillarySE-30180.1248.Korhonen, 1986N2; Column length: 25. m; Column diameter: 0.33 mm
CapillarySE-30200.1248.Korhonen, 1986N2; Column length: 25. m; Column diameter: 0.33 mm
CapillarySE-30220.1262.Korhonen, 1986N2; Column length: 25. m; Column diameter: 0.33 mm
CapillarySE-30160.1264.Korhonen and Lind, 1985N2; Column length: 25. m; Column diameter: 0.33 mm
CapillarySE-30180.1272.Korhonen and Lind, 1985N2; Column length: 25. m; Column diameter: 0.33 mm
CapillarySE-30200.1276.Korhonen and Lind, 1985N2; Column length: 25. m; Column diameter: 0.33 mm
PackedSE-30200.1268.Haken, Hartley, et al., 1983Chromosorb W AW DMCS; Column length: 3.7 m
PackedSE-30100.1245.Pías and Gascó, 1975Ar, Chromosorb W AW DMCS HP (80-100 mesh); Column length: 1. m
PackedSE-30120.1254.Pías and Gascó, 1975Ar, Chromosorb W AW DMCS HP (80-100 mesh); Column length: 1. m
PackedSE-30140.1262.Pías and Gascó, 1975Ar, Chromosorb W AW DMCS HP (80-100 mesh); Column length: 1. m

Kovats' RI, polar column, isothermal

View large format table.

Column type Active phase Temperature (C) I Reference Comment
CapillaryOV-351180.1791.Korhonen, 1986N2; Column length: 25. m; Column diameter: 0.32 mm
CapillaryOV-351200.1812.Korhonen, 1986N2; Column length: 25. m; Column diameter: 0.32 mm
CapillaryOV-351160.1777.Korhonen and Lind, 1985N2; Column length: 25. m; Column diameter: 0.32 mm
CapillaryOV-351180.1791.Korhonen and Lind, 1985N2; Column length: 25. m; Column diameter: 0.32 mm
CapillaryOV-351200.1818.Korhonen and Lind, 1985N2; Column length: 25. m; Column diameter: 0.32 mm

Van Den Dool and Kratz RI, non-polar column, temperature ramp

View large format table.

Column type Active phase I Reference Comment
CapillaryDB-11237.2Sun and Stremple, 200330. m/0.25 mm/0.25 μm, He, 3. K/min; Tstart: 40. C; Tend: 325. C
CapillarySE-301249.Korhonen, 1986N2, 6. K/min; Column length: 25. m; Column diameter: 0.33 mm; Tstart: 100. C; Tend: 310. C
CapillarySE-301257.Korhonen and Lind, 1985N2, 10. K/min; Column length: 25. m; Column diameter: 0.33 mm; Tstart: 100. C; Tend: 320. C
CapillarySE-301247.Korhonen and Lind, 1985N2, 2. K/min; Column length: 25. m; Column diameter: 0.33 mm; Tstart: 100. C; Tend: 320. C
CapillarySE-301252.Korhonen and Lind, 1985N2, 6. K/min; Column length: 25. m; Column diameter: 0.33 mm; Tstart: 100. C; Tend: 320. C

Van Den Dool and Kratz RI, polar column, temperature ramp

View large format table.

Column type Active phase I Reference Comment
CapillaryOV-3511742.Korhonen, 1986N2, 6. K/min; Column length: 25. m; Column diameter: 0.32 mm; Tstart: 100. C; Tend: 220. C
CapillaryOV-3511757.Korhonen and Lind, 1985N2, 10. K/min; Column length: 25. m; Column diameter: 0.32 mm; Tstart: 100. C; Tend: 230. C
CapillaryOV-3511753.Korhonen and Lind, 1985N2, 2. K/min; Column length: 25. m; Column diameter: 0.32 mm; Tstart: 100. C; Tend: 230. C
CapillaryOV-3511745.Korhonen and Lind, 1985N2, 6. K/min; Column length: 25. m; Column diameter: 0.32 mm; Tstart: 100. C; Tend: 230. C

Normal alkane RI, non-polar column, isothermal

View large format table.

Column type Active phase Temperature (C) I Reference Comment
PackedSE-30120.1254.Pias Barbeira and Gasco, 1975Argon, Chromosorb W AW DMCS (80-100 mesh); Column length: 1. m

Normal alkane RI, non-polar column, temperature ramp

View large format table.

Column type Active phase I Reference Comment
CapillaryHP-11241.Castel, Fernandez, et al., 200650. m/0.2 mm/0.33 μm, He, 60. C @ 4. min, 2. K/min, 250. C @ 30. min
CapillaryHP-11238.Castel, Fernandez, et al., 200650. m/0.2 mm/0.33 μm, He, 60. C @ 4. min, 2. K/min, 250. C @ 30. min
CapillaryHP-11236.Castel, Fernandez, et al., 200650. m/0.2 mm/0.33 μm, He, 60. C @ 4. min, 2. K/min, 250. C @ 30. min
CapillaryHP-11247.Castel, Fernandez, et al., 2006, 250. m/0.2 mm/0.5 μm, He, 2. K/min, 250. C @ 120. min; Tstart: 60. C
CapillaryHP-11247.Castel, Fernandez, et al., 2006, 250. m/0.2 mm/0.33 μm, He, 60. C @ 4. min, 2. K/min, 250. C @ 30. min
CapillaryDB-5MS1284.Robledo and Arzuffi, 200430. m/0.25 mm/0.25 μm, 30. K/min, 200. C @ 10. min; Tstart: 90. C
CapillaryHP-11247.Fernandez, Lizzani-Cuvelier, et al., 200350. m/0.2 mm/0.5 μm, He, 2. K/min, 220. C @ 45. min; Tstart: 60. C
CapillaryUltra-11238.Okumura, 199125. m/0.32 mm/0.25 μm, He, 3. K/min; Tstart: 80. C; Tend: 260. C

Normal alkane RI, non-polar column, custom temperature program

View large format table.

Column type Active phase I Reference Comment
CapillarySE-301254.Vinogradov, 2004Program: not specified

Normal alkane RI, polar column, custom temperature program

View large format table.

Column type Active phase I Reference Comment
CapillaryCarbowax 20M1745.Vinogradov, 2004Program: not specified

References

Aldrich Chemical Company Inc., 1990
Aldrich Chemical Company Inc.,
Catalog Handbook of Fine Chemicals, Aldrich Chemical Company, Inc., Milwaukee WI, 1990, 1. [all data]
Katayama, 1988
Katayama, Hirotake,
Vapor pressures of methyl, ethyl, n-propyl, isobutyl, and n-butyl benzoates at reduced pressures,
J. Chem. Eng. Data, 1988, 33, 2, 75-77, https://doi.org/10.1021/je00052a002
. [all data]
Stephenson and Malanowski, 1987
Stephenson, Richard M.; Malanowski, Stanislaw,
Handbook of the Thermodynamics of Organic Compounds, 1987, https://doi.org/10.1007/978-94-009-3173-2
. [all data]
Stull, 1947
Stull, Daniel R.,
Vapor Pressure of Pure Substances. Organic and Inorganic Compounds,
Ind. Eng. Chem., 1947, 39, 4, 517-540, https://doi.org/10.1021/ie50448a022
. [all data]
Tajima, Azami, et al., 1977
Tajima, S.; Azami, T.; Tsuchiya, T.,
An investigation of the decomposition of the common intermediate ions produced by electron impact,
Org. Mass Spectrom., 1977, 12, 24. [all data]