Carbonotrithioic acid, dimethyl ester
- Formula: C3H6S3
- Molecular weight: 138.275
- IUPAC Standard InChIKey: IQWMXKTYXNMSLC-UHFFFAOYSA-N
- CAS Registry Number: 2314-48-9
- Chemical structure:
View 3d structure (requires JavaScript / HTML 5) - Other names: Carbonic acid, trithio-, dimethyl ester; Dimethyl trithiocarbonate; (CH3S)2CS; Dimethylester kyseliny trithiouhlicite; Trithiocarbonic acid dimethyl ester; Dimethyl carbonotrithioate

Gas phase thermochemistry data

Data compiled by: Hussein Y. Afeefy, Joel F. Liebman, and Stephen E. Stein
Quantity | Value | Units | Method | Reference | Comment |
---|---|---|---|---|---|
ΔfH°gas | 57.7 | kJ/mol | Ccb | Geiseler and Rauh, 1972 | Hf_H2SO4.115H2O=-143.885 Kcal/mol |

Condensed phase thermochemistry data

Data compiled by: Hussein Y. Afeefy, Joel F. Liebman, and Stephen E. Stein
Quantity | Value | Units | Method | Reference | Comment |
---|---|---|---|---|---|
ΔfH°liquid | -8.4 ± 4.2 | kJ/mol | Ccb | Geiseler and Rauh, 1972 | Hf_H2SO4.115H2O=-143.885 Kcal/mol |
Quantity | Value | Units | Method | Reference | Comment |
ΔcH°liquid | -3836. ± 4.2 | kJ/mol | Ccb | Geiseler and Rauh, 1972 | Hf_H2SO4.115H2O=-143.885 Kcal/mol |

Phase change data

Data compiled as indicated in comments:
TRC - Thermodynamics Research Center, NIST Boulder Laboratories, Chris Muzny director
ALS - Hussein Y. Afeefy, Joel F. Liebman, and Stephen E. Stein
DRB - Donald R. Burgess, Jr.
Quantity | Value | Units | Method | Reference | Comment |
---|---|---|---|---|---|
Tfus | 266.9 | K | N/A | Timmermans, 1922 | Uncertainty assigned by TRC = 0.6 K; TRC |
Quantity | Value | Units | Method | Reference | Comment |
ΔvapH° | 66.27 | kJ/mol | V | Geiseler and Rauh, 1972 | Hf_H2SO4.115H2O=-143.885 Kcal/mol; ALS |
ΔvapH° | 66.1 | kJ/mol | N/A | Geiseler and Rauh, 1972 | DRB |

Gas phase ion energetics data

Data compiled as indicated in comments:
LLK - Sharon G. Lias, Rhoda D. Levin, and Sherif A. Kafafi
Ionization energy determinations
IE (eV) | Method | Reference | Comment |
---|---|---|---|
7.9 | PE | Guimon, Gonbeau, et al., 1974 | LLK |
8.5 | PE | Guimon, Gonbeau, et al., 1974 | Vertical value; LLK |

Van Den Dool and Kratz RI, non-polar column, custom temperature program

Column type | Active phase | I | Reference | Comment |
---|---|---|---|---|
Capillary | HP-5MS | 1195.8 | Andriamaharavo, 2014 | 30. m/0.25 mm/0.25 μm, He; Program: 60C (1 min) => 5 C/min => 210C => 10 C/min => 280C (15 min) |

References

Geiseler and Rauh, 1972
Geiseler, G.; Rauh, H.-J.,
Bildungsenthalpien und Mesomerieenergien von π-Bindungssystemen 3. Mitteilung: Bildungsenthalpie und Verdrillung der S-S-Bindung in Trithionen,
Z. Phys. Chem. (Leipzig), 1972, 249, 376-382. [all data]
Timmermans, 1922
Timmermans, J.,
Investigation of the Freezing Point of Organic Substances VII,
Bull. Soc. Chim. Belg., 1922, 31, 389. [all data]
Guimon, Gonbeau, et al., 1974
Guimon, C.; Gonbeau, D.; Pfister-Guillouzo, G.; Asbrink, L.; Sandstrom, J.,
Electronic structure of sulphur compounds. VI. Photoelectron spectra of some simple thiocarbonyl compounds,
J. Electron Spectrosc. Relat. Phenom., 1974, 4, 49. [all data]
Janssen, 1960
Janssen, M.J.,
Rec. trav. chim., 1960, 79, 464. [all data]
Andriamaharavo, 2014
Andriamaharavo, N.R.,
Retention Data. NIST Mass Spectrometry Data Center., NIST Mass Spectrometry Data Center, 2014. [all data]