1,2,2-Trimethylaziridine
- Formula: C5H11N
- Molecular weight: 85.1475
- IUPAC Standard InChIKey: DVDMSISHJUNIAQ-UHFFFAOYSA-N
- CAS Registry Number: 23132-47-0
- Chemical structure:
View 3d structure (requires JavaScript / HTML 5) - Permanent link for this species. Use this link for bookmarking this species for future reference.

Gas phase ion energetics data

Data compiled as indicated in comments:
LLK - Sharon G. Lias, Rhoda D. Levin, and Sherif A. Kafafi
Ionization energy determinations
IE (eV) | Method | Reference | Comment |
---|---|---|---|
8.68 ± 0.02 | PE | Yoshikawa, Hashimoto, et al., 1974 | Vertical value; LLK |

References

Yoshikawa, Hashimoto, et al., 1974
Yoshikawa, K.; Hashimoto, M.; Morishima, I.,
Photoelectron spectroscopic study of cyclic amines. The relation between ionization potentials, basicities, and s character of the nitrogen lone pair electrons,
J. Am. Chem. Soc., 1974, 96, 288. [all data]