Cyclopropene,1,2-dimethyl-3-phenyl-
- Formula: C11H12
- Molecular weight: 144.2130
- IUPAC Standard InChIKey: ASCFKFSNSITADI-UHFFFAOYSA-N
- CAS Registry Number: 23063-31-2
- Chemical structure:
View 3d structure (requires JavaScript / HTML 5) - Permanent link for this species. Use this link for bookmarking this species for future reference.

Gas phase ion energetics data

Data compiled as indicated in comments:
LBLHLM - Sharon G. Lias, John E. Bartmess, Joel F. Liebman, John L. Holmes, Rhoda D. Levin, and W. Gary Mallard
Ionization energy determinations
IE (eV) | Method | Reference | Comment |
---|---|---|---|
8.17 | PE | Baidin, Domnin, et al., 1984 | Vertical value; LBLHLM |

References

Baidin, Domnin, et al., 1984
Baidin, V.N.; Domnin, I.N.; Prokhorenko, O.A.; Elbel, S.; de Meijere, A.,
Photoelectron spectra of phenyl substituted cyclopropene derivatives,
J. Electron Spectrosc. Relat. Phenom., 1984, 34, 103. [all data]