1-Hexen-3-yne, 2-methyl-
- Formula: C7H10
- Molecular weight: 94.1543
- IUPAC Standard InChIKey: IXPWKHNDQICVPZ-UHFFFAOYSA-N
- CAS Registry Number: 23056-94-2
- Chemical structure:
View 3d structure (requires JavaScript / HTML 5) - Other names: C2H5C≡CC(CH3)=CH2; 2-Methyl-1-hexen-3-yne

Phase change data

Data compiled by: Robert L. Brown and Stephen E. Stein
Quantity | Value | Units | Method | Reference | Comment |
---|---|---|---|---|---|
Tboil | 377.6 | K | N/A | Farchan Laboratories, 1990 |

Gas phase ion energetics data

Data compiled as indicated in comments:
LLK - Sharon G. Lias, Rhoda D. Levin, and Sherif A. Kafafi
Ionization energy determinations
IE (eV) | Method | Reference | Comment |
---|---|---|---|
8.66 ± 0.01 | PE | Carlier, Mouvier, et al., 1979 | LLK |

References

Farchan Laboratories, 1990
Farchan Laboratories,
Research Chemicals Catalog, Farchan Laboratories, Gainesville, FL, 1990, 91. [all data]
Carlier, Mouvier, et al., 1979
Carlier, P.; Mouvier, G.; Mesnard, D.; Miginiac, L.,
Etude par spectrometrie de photoelectrons de la structure electronique des phenyl-alcynes conjugues,
J. Electron Spectrosc. Relat. Phenom., 1979, 16, 147. [all data]