3,4-Dimethoxybenzoic acid nitrile
- Formula: C9H9NO2
- Molecular weight: 163.1733
- IUPAC Standard InChIKey: OSEQIDSFSBWXRE-UHFFFAOYSA-N
- CAS Registry Number: 23024-83-1
- Chemical structure:
View 3d structure (requires JavaScript / HTML 5) - Permanent link for this species. Use this link for bookmarking this species for future reference.

Gas phase ion energetics data

Data compiled by: Henry M. Rosenstock, Keith Draxl, Bruce W. Steiner, and John T. Herron
Ionization energy determinations
IE (eV) | Method | Reference |
---|---|---|
8.72 ± 0.06 | EI | Buchs, 1970 |

References

Buchs, 1970
Buchs, A.,
Etude par spectrometrie de masse de l'ionisation de benzonitriles, de phenylacetonitriles et de N,N-dimethylanilines substitues,
Helv. Chim. Acta, 1970, 53, 2026. [all data]