Fluorenyl radical
- Formula: C13H9
- Molecular weight: 165.2106
- IUPAC Standard InChIKey: RMBPEFMHABBEKP-UHFFFAOYSA-N
- CAS Registry Number: 2299-68-5
- Chemical structure:
View 3d structure (requires JavaScript / HTML 5) - Permanent link for this species. Use this link for bookmarking this species for future reference.

Gas phase ion energetics data

Data compiled as indicated in comments:
RDSH - Henry M. Rosenstock, Keith Draxl, Bruce W. Steiner, and John T. Herron
B - John E. Bartmess
Electron affinity determinations
EA (eV) | Method | Reference | Comment |
---|---|---|---|
1.869 ± 0.013 | LPD | Römer, Janaway, et al., 1997 | B |
1.81 ± 0.13 | D-EA | Taft and Bordwell, 1988 | B |
Ionization energy determinations
IE (eV) | Method | Reference | Comment |
---|---|---|---|
7.07 | EI | Pottie and Lossing, 1963 | RDSH |

References

Römer, Janaway, et al., 1997
Römer, B.; Janaway, G.; Brauman, J.I.,
Cyclopentadienyl, Indenyl, and Fluorenyl Anions: Gas-Phase and Solvation Energy Contributions to Electron Detachment Energies,
J. Am. Chem. Soc., 1997, 119, 9, 2249, https://doi.org/10.1021/ja961947x
. [all data]
Taft and Bordwell, 1988
Taft, R.W.; Bordwell, F.G.,
Structural and Solvent Effects Evaluated from Acidities Measured in Dimethyl Sulfoxide and in the Gas Phase,
Acc. Chem. Res., 1988, 21, 12, 463, https://doi.org/10.1021/ar00156a005
. [all data]
Pottie and Lossing, 1963
Pottie, R.F.; Lossing, F.P.,
Free radicals by mass spectrometry. XXIX. Ionization potentials of substituted cyclopentadienyl radicals,
J. Am. Chem. Soc., 1963, 85, 269. [all data]