2-Oxabicyclo[2.2.0]hex-5-en-3-one
- Formula: C5H4O2
- Molecular weight: 96.0841
- IUPAC Standard InChIKey: QAVYTTBRXJVSNJ-UHFFFAOYSA-N
- CAS Registry Number: 22980-23-0
- Chemical structure:
View 3d structure (requires JavaScript / HTML 5) - Other names: 2-Oxa-3-oxobicyclo[2.2.0]hex-5-ene

Gas phase ion energetics data

Data compiled by: Henry M. Rosenstock, Keith Draxl, Bruce W. Steiner, and John T. Herron
Appearance energy determinations
Ion | AE (eV) | Other Products | Method | Reference | Comment |
---|---|---|---|---|---|
C4H4+ | 10.2 | ? | EI | Hedaya, Miller, et al., 1969 |

References

Hedaya, Miller, et al., 1969
Hedaya, E.; Miller, R.D.; McNeil, D.W.; D'Angelo, P.F.; Schissel, P.,
Flash vacuum pyrolysis. V. Cyclobutadiene,
J. Am. Chem. Soc., 1969, 91, 1875. [all data]