1,1,3-Trimethyl-1-silacyclobutane
- Formula: C6H14Si
- Molecular weight: 114.2609
- IUPAC Standard InChIKey: IHVAPVIGBKYZTE-UHFFFAOYSA-N
- CAS Registry Number: 2295-13-8
- Chemical structure:
View 3d structure (requires JavaScript / HTML 5) - Other names: Silacyclobutane, 1,1,3-trimethyl-; 1,1,3-Trimethylsilacyclobutane

Phase change data

Data compiled by: William E. Acree, Jr., James S. Chickos
Quantity | Value | Units | Method | Reference | Comment |
---|---|---|---|---|---|
ΔvapH° | 35.5 | kJ/mol | C | Voronkov, Klyuchnikov, et al., 1991 |

Gas phase ion energetics data

Data compiled as indicated in comments:
LLK - Sharon G. Lias, Rhoda D. Levin, and Sherif A. Kafafi
Ionization energy determinations
IE (eV) | Method | Reference | Comment |
---|---|---|---|
8.67 ± 0.03 | EI | Gusel'nikov, Volkova, et al., 1981 | LLK |
Appearance energy determinations
Ion | AE (eV) | Other Products | Method | Reference | Comment |
---|---|---|---|---|---|
C3H8Si+ | 9.74 ± 0.04 | C3H6 | EI | Gusel'nikov, Volkova, et al., 1981 | LLK |
C4H10Si+ | 9.30 ± 0.04 | C2H4 | EI | Gusel'nikov, Volkova, et al., 1981 | LLK |

References

Voronkov, Klyuchnikov, et al., 1991
Voronkov, M.G.; Klyuchnikov, V.A.; Sokolova, E.V.; Danilova, T.F.; Shvets, G.N.; Korchagina, A.N.; Gussel'nikov, L.E.; Volkova, V.V.,
Thermochemistry of organosilicon compounds,
Journal of Organometallic Chemistry, 1991, 401, 3, 245-248, https://doi.org/10.1016/0022-328X(91)86222-C
. [all data]
Gusel'nikov, Volkova, et al., 1981
Gusel'nikov, L.E.; Volkova, V.V.; Tarasenko, N.A.; Tishenkov, A.A.; Zaikin, V.G.; Eremina, E.I.; Nametkin, N.S.,
Deuterium labelling and thermochemical studies of dissociative ionization of methyl substituted monosilacyclobutanes. Ring expansion in the molecular ion of 1,1,3-trimethylΣ-1-silacyclobutane,
Org. Mass Spectrom., 1981, 16, 242. [all data]