Trimethylsilyl isothiocyanate
- Formula: C4H9NSSi
- Molecular weight: 131.271
- IUPAC Standard InChIKey: XLTUPERVRFLGLJ-UHFFFAOYSA-N
- CAS Registry Number: 2290-65-5
- Chemical structure:
View 3d structure (requires JavaScript / HTML 5) - Other names: Silane, isothiocyanatotrimethyl-

Gas phase ion energetics data

Data compiled as indicated in comments:
LL - Sharon G. Lias and Joel F. Liebman
LLK - Sharon G. Lias, Rhoda D. Levin, and Sherif A. Kafafi
Ionization energy determinations
IE (eV) | Method | Reference | Comment |
---|---|---|---|
9.26 | PE | Veszpremi, Pasinszki, et al., 1991 | Vertical value; LL |
9.3 ± 0.1 | PE | Cradock, Ebsworth, et al., 1972 | Vertical value; LLK |

References

Veszpremi, Pasinszki, et al., 1991
Veszpremi, T.; Pasinszki, T.; Feher, M.,
Photoelectron spectroscopic studies of the silicon pseudohalides: Relationship between geometrical and electronic structure,
J. Chem. Soc. Faraday Trans., 1991, 87, 3805. [all data]
Cradock, Ebsworth, et al., 1972
Cradock, S.; Ebsworth, E.A.V.; Murdoch, J.D.,
Photoelectron spectra of some Group 4 pseudohalides and related compounds,
J. Chem. Soc. Faraday Trans. 2, 1972, 68, 86. [all data]