Benzonitrile, 3,4-dimethyl-
- Formula: C9H9N
- Molecular weight: 131.1745
- IUPAC Standard InChIKey: OWISXYQFTOYGRO-UHFFFAOYSA-N
- CAS Registry Number: 22884-95-3
- Chemical structure:
View 3d structure (requires JavaScript / HTML 5) - Other names: 1,2-Dimethyl-4-cyanobenzene; 3,4-Dimethylbenzonitrile; 3,4-Dimethylbenzoic acid nitrile

Phase change data

Data compiled by: Thermodynamics Research Center, NIST Boulder Laboratories, Chris Muzny director
Quantity | Value | Units | Method | Reference | Comment |
---|---|---|---|---|---|
Tfus | 338.9 | K | N/A | Birch, Dean, et al., 1949 | Uncertainty assigned by TRC = 1. K |

Gas phase ion energetics data

Data compiled by: Henry M. Rosenstock, Keith Draxl, Bruce W. Steiner, and John T. Herron
Ionization energy determinations
IE (eV) | Method | Reference |
---|---|---|
9.16 ± 0.04 | EI | Buchs, 1970 |

References

Birch, Dean, et al., 1949
Birch, S.F.; Dean, R.A.; Fidler, F.A.; Lowry, R.A.,
The preparation of the c(10) monocyclic aromatic hydrocarbons,
J. Am. Chem. Soc., 1949, 71, 1362. [all data]
Buchs, 1970
Buchs, A.,
Etude par spectrometrie de masse de l'ionisation de benzonitriles, de phenylacetonitriles et de N,N-dimethylanilines substitues,
Helv. Chim. Acta, 1970, 53, 2026. [all data]