Benzene, (1-methylene-2-propenyl)-
- Formula: C10H10
- Molecular weight: 130.1864
- IUPAC Standard InChIKey: IMJGQTCMUZMLRZ-UHFFFAOYSA-N
- CAS Registry Number: 2288-18-8
- Chemical structure:
View 3d structure (requires JavaScript / HTML 5) - Other names: 1,3-Butadiene, 2-phenyl-; Phenoprene; 2-Phenylbutadiene; 2-Phenyl-1,3-butadiene

Phase change data

Data compiled by: Robert L. Brown and Stephen E. Stein
Reduced pressure boiling point
Tboil (K) | Pressure (bar) | Reference |
---|---|---|
333.7 | 0.023 | Weast and Grasselli, 1989 |

Gas phase ion energetics data

Data compiled as indicated in comments:
LBLHLM - Sharon G. Lias, John E. Bartmess, Joel F. Liebman, John L. Holmes, Rhoda D. Levin, and W. Gary Mallard
LLK - Sharon G. Lias, Rhoda D. Levin, and Sherif A. Kafafi
Ionization energy determinations
IE (eV) | Method | Reference | Comment |
---|---|---|---|
8.19 | EI | Dass and Gross, 1983 | LBLHLM |
8.10 ± 0.05 | EI | Derocque and Jochem, 1975 | LLK |
8.60 | PE | Heilbronner and Jones, 1978 | Vertical value; LLK |
8.57 | PE | Sustmann and Schubert, 1972 | Vertical value; LLK |

Van Den Dool and Kratz RI, non-polar column, temperature ramp

Column type | Active phase | I | Reference | Comment |
---|---|---|---|---|
Capillary | SE-54 | 1140.2 | Shapi and Hesso, 1990 | 25. m/0.32 mm/0.15 μm, He, 40. C @ 1. min, 5. K/min, 280. C @ 15. min |

References

Weast and Grasselli, 1989
CRC Handbook of Data on Organic Compounds, 2nd Editon, Weast,R.C and Grasselli, J.G., ed(s)., CRC Press, Inc., Boca Raton, FL, 1989, 1. [all data]
Dass and Gross, 1983
Dass, C.; Gross, M.L.,
Electrocyclic ring opening of 1-phenylcyclobutene and 3-phenylcyclobutene radical cations,
J. Am. Chem. Soc., 1983, 105, 5724. [all data]
Derocque and Jochem, 1975
Derocque, J.-L.; Jochem, M.,
Studies in mass spectrometry. III. Formation of a common intermediate in the primary fragmentation process of 1-phenylcyclobutene and of 2-phenyl-1,3-butadiene,
Org. Mass Spectrom., 1975, 10, 935. [all data]
Heilbronner and Jones, 1978
Heilbronner, E.; Jones, T.B.,
Spectral differences between "isospectral" molecules,
J. Am. Chem. Soc., 1978, 100, 6506. [all data]
Sustmann and Schubert, 1972
Sustmann, R.; Schubert, R.,
Photoelektronenspektroskopische bestimmung von substituenten-effekten. I. Subtituierte butadiene,
Tetrahedron Lett., 1972, 27, 2739. [all data]
Shapi and Hesso, 1990
Shapi, M.M.; Hesso, A.,
Thermal decomposition of polystyrene volatile compounds from large-scale pyrolysis,
J. Anal. Appl. Pyrolysis, 1990, 18, 2, 143-161, https://doi.org/10.1016/0165-2370(90)80004-8
. [all data]