1-Anilinoethylidenechromium pentacarbonyl
- Formula: C13H9CrNO5
- Molecular weight: 311.2104
- IUPAC Standard InChIKey: NSTAMNUQJYYOPF-UHFFFAOYSA-N
- CAS Registry Number: 22852-51-3
- Chemical structure:
View 3d structure (requires JavaScript / HTML 5) - Permanent link for this species. Use this link for bookmarking this species for future reference.

Gas phase ion energetics data

Data compiled by: Henry M. Rosenstock, Keith Draxl, Bruce W. Steiner, and John T. Herron
Ionization energy determinations
IE (eV) | Method | Reference |
---|---|---|
7.02 | EI | Muller and Connor, 1969 |

References

Muller and Connor, 1969
Muller, J.; Connor, J.A.,
Massenspektroskopische Untersuchungen an Pentacarbonylchrom-carben-Komplexen,
Chem. Ber., 1969, 102, 1148. [all data]