1,3-Hexadiene, 2-(dimethylethyl)-5,5-dimethyl-, (E)-
- Formula: C12H22
- Molecular weight: 166.3031
- IUPAC Standard InChIKey: OYAQFAPAKGNWSQ-CMDGGOBGSA-N
- CAS Registry Number: 22833-90-5
- Chemical structure:
View 3d structure (requires JavaScript / HTML 5) - Permanent link for this species. Use this link for bookmarking this species for future reference.

Gas phase ion energetics data

Data compiled by: Henry M. Rosenstock, Keith Draxl, Bruce W. Steiner, and John T. Herron
Ionization energy determinations
IE (eV) | Method | Reference | Comment |
---|---|---|---|
8.22 ± 0.04 | EI | Bock and Seidl, 1968 | Vertical value |

References

Bock and Seidl, 1968
Bock, H.; Seidl, H.,
'd-Orbital effects' in silicon- substituted π-electron systems. XI. Syntheses and properties of the isomeric bis(trimethylsilyl)-1,3-butadienes,
J. Am. Chem. Soc., 1968, 90, 5694. [all data]