Benzene, 1,1'-(1,3,5,7-octatetraene-1,8-diyl)bis-, (all-E)-
- Formula: C20H18
- Molecular weight: 258.3569
- IUPAC Standard InChIKey: ZENGMMQJMCPHTK-FPPPDJHPSA-N
- CAS Registry Number: 22828-29-1
- Chemical structure:
View 3d structure (requires JavaScript / HTML 5) - Stereoisomers:
- Other names: 1,3,5,7-Octatetraene, 1,8-diphenyl-, (all-E)-; All-trans-Diphenyloctatetraene; Benzene,1,1'-(1,3,5,7-octatetraene-1,8-diyl)bis-

Gas phase ion energetics data

Data compiled as indicated in comments:
LLK - Sharon G. Lias, Rhoda D. Levin, and Sherif A. Kafafi
RDSH - Henry M. Rosenstock, Keith Draxl, Bruce W. Steiner, and John T. Herron
Ionization energy determinations
IE (eV) | Method | Reference | Comment |
---|---|---|---|
7.19 | PE | Hudson, Ridyard, et al., 1976 | LLK |
7.5 | DER | Briegleb and Czekalla, 1959 | RDSH |

References

Hudson, Ridyard, et al., 1976
Hudson, B.S.; Ridyard, J.N.A.; Diamond, J.,
Polyene spectroscopy. Photoelectron spectra of the diphenylpolyenes,
J. Am. Chem. Soc., 1976, 98, 1126. [all data]
Briegleb and Czekalla, 1959
Briegleb, G.; Czekalla, J.,
Die Bestimmung von lonisierungsenergien aus den Spektren von Elektronenubergangskomplexen,
Z.Elektrochem., 1959, 63, 6. [all data]
Dahne and Schob, 1973
Dahne, S.; Schob, F.,
J. prakt. Chem., 1973, 315, 810. [all data]