2,4-Hexanedione, 1,1,1-trifluoro-5,5-dimethyl-
- Formula: C8H11F3O2
- Molecular weight: 196.1669
- IUPAC Standard InChIKey: BVPKYBMUQDZTJH-UHFFFAOYSA-N
- CAS Registry Number: 22767-90-4
- Chemical structure:
View 3d structure (requires JavaScript / HTML 5) - Other names: 1,1,1-Trifluoro-5,5-dimethyl-2,4-hexanedione; 1,1,1-trifluoro-5,5-dimethylhexane-2,4-dione

Phase change data

Data compiled by: Robert L. Brown and Stephen E. Stein
Reduced pressure boiling point
Tboil (K) | Pressure (bar) | Reference |
---|---|---|
341. to 344. | 0.008 | PCR Inc., 1990 |

Gas phase ion energetics data

Data compiled by: Sharon G. Lias, Rhoda D. Levin, and Sherif A. Kafafi
Ionization energy determinations
IE (eV) | Method | Reference | Comment |
---|---|---|---|
9.87 ± 0.07 | PE | Evans, Hamnett, et al., 1972 | Vertical value |

References

PCR Inc., 1990
PCR Inc.,
Research Chemicals Catalog 1990-1991, PCR Inc., Gainesville, FL, 1990, 1. [all data]
Evans, Hamnett, et al., 1972
Evans, S.; Hamnett, A.; Orchard, A.F.; Lloyd, D.R.,
Study of the metal-oxygen bond in simple tris-chelate complexes by He(I) photoelectron spectroscopy,
Faraday Discuss. Chem. Soc., 1972, 54, 227. [all data]