Vamidothion
- Formula: C8H18NO4PS2
- Molecular weight: 287.337
- IUPAC Standard InChIKey: LESVOLZBIFDZGS-UHFFFAOYSA-N
- CAS Registry Number: 2275-23-2
- Chemical structure:
View 3d structure (requires JavaScript / HTML 5) - Other names: Phosphorothioic acid, O,O-dimethyl S-[2-[[1-methyl-2-(methylamino)-2-oxoethyl]thio]ethyl] ester; Phosphorothioic acid, O,O-dimethyl ester, S-ester with 2-[(2-mercaptoethyl)thio]-N-methylpropionamide; Dimethyl S-[2-(1-methylcarbamoylethylthio)ethyl] phosphorothiolate; Kilval; O,O-Dimethyl S-[2-(1-methylcarbamoylethylthio)ethyl] phosphorothioate; RP 9895; Vamidoate; American cyanamid-43073; O,O-Dimethyl S-2-(1-N-methylcarbamoylethylmercapto)ethyl thiophosphate; ENT 26,613; N-Methyl O,O-dimethylthiolophosphoryl-5-thia-3-methyl-2-valeramide; N-Methyl-3-thia-2-methyl-valeramid der O,O-dimethylthiolphosphorsaeure; NPH 83; R.P. 10,465; Trucidor

Van Den Dool and Kratz RI, non-polar column, temperature ramp

Column type | Active phase | I | Reference | Comment |
---|---|---|---|---|
Capillary | CBP-1 | 2036. | Oyama, Sano, et al., 1987 | N2, 6. K/min; Column length: 12. m; Column diameter: 0.53 mm; Tstart: 120. C; Tend: 250. C |

Normal alkane RI, non-polar column, isothermal

Column type | Active phase | Temperature (C) | I | Reference | Comment |
---|---|---|---|---|---|
Packed | OV-1 | 190. | 2080. | TSunoda, 1986 | Helium, Chromosorb W AW DMCS; Column length: 1. m |

Normal alkane RI, non-polar column, temperature ramp

Column type | Active phase | I | Reference | Comment |
---|---|---|---|---|
Packed | OV-1 | 2075. | TSunoda, 1986 | Helium, Chromosorb W AW DMCS, 4. K/min, 210. C @ 20. min; Column length: 1. m; Tstart: 140. C |

References

Oyama, Sano, et al., 1987
Oyama, N.; Sano, T.; Syoyama, M.; Maeda, K.,
Studies on systematic analysis of poisonous compounds in forensic chemistry. II. Application of capillary column gas chromatography to substance identification by means of retention indices,
Eisei Kagaku, 1987, 33, 5, 342-348, https://doi.org/10.1248/jhs1956.33.342
. [all data]
TSunoda, 1986
TSunoda, N.,
Simultaneous determination of organophosphorous pesticides in forencis chemistry by gas-liquid chromatography with hydrogen flame ionization detector,
Eisei Kagaku, 1986, 32, 2, 91-100, https://doi.org/10.1248/jhs1956.32.91
. [all data]