1-Piperidineacetonitrile, α,α-dimethyl-

Gas phase thermochemistry data

Data compiled by: Hussein Y. Afeefy, Joel F. Liebman, and Stephen E. Stein

Quantity Value Units Method Reference Comment
Δfgas24.03 ± 0.82kJ/molCcbWelle, Verevkin, et al., 1997

Condensed phase thermochemistry data

Data compiled by: Hussein Y. Afeefy, Joel F. Liebman, and Stephen E. Stein

Quantity Value Units Method Reference Comment
Δfsolid-56.30 ± 0.69kJ/molCcbWelle, Verevkin, et al., 1997
Quantity Value Units Method Reference Comment
Δcsolid-5771.92 ± 0.68kJ/molCcbWelle, Verevkin, et al., 1997

Phase change data

Data compiled as indicated in comments:
ALS - Hussein Y. Afeefy, Joel F. Liebman, and Stephen E. Stein
AC - William E. Acree, Jr., James S. Chickos

Quantity Value Units Method Reference Comment
Δsub80.33 ± 0.45kJ/molVWelle, Verevkin, et al., 1997ALS
Δsub80.3 ± 0.5kJ/molN/AWelle, Verevkin, et al., 1997AC

Enthalpy of fusion

ΔfusH (kJ/mol) Temperature (K) Reference Comment
21.59316.2Welle, Verevkin, et al., 1997AC

References

Welle, Verevkin, et al., 1997
Welle, F.M.; Verevkin, S.P.; Beckhaus, H.-D.; Ruchardt, C., Stabilization of the cyano(dimethylamino)methyl radical - synergistic effect due to interaction between α-cyano groups on the radical stabilization energy, Liebigs Ann., 1997, 155-163. [all data]