Dibenzo[a,l]pentacene
- Formula: C30H18
- Molecular weight: 378.4639
- IUPAC Standard InChIKey: XSTMLGGLUNLJRY-UHFFFAOYSA-N
- CAS Registry Number: 227-09-8
- Chemical structure:
View 3d structure (requires JavaScript / HTML 5) - Other names: 1,2,8,9-Dibenzpentacene; 1,2:8,9-Dibenzopentacene; Dibenzo-1,2,8,9-pentacene; 1,2,8,9-Dibenzopentacene; 1,2:8,9-Dibenzpentacene; Dibenzo(a1)pentacene

Gas phase ion energetics data

Data compiled as indicated in comments:
LLK - Sharon G. Lias, Rhoda D. Levin, and Sherif A. Kafafi
RDSH - Henry M. Rosenstock, Keith Draxl, Bruce W. Steiner, and John T. Herron
Ionization energy determinations
IE (eV) | Method | Reference | Comment |
---|---|---|---|
6.64 ± 0.02 | PE | Schmidt, 1977 | LLK |
6.77 | PE | Clar and Schmidt, 1975 | LLK |
7.0 ± 0.1 | EI | Gallegos, 1968 | RDSH |
6.77 | CTS | Briegleb, 1964 | RDSH |
6.42 | CTS | Matsen, 1956 | RDSH |

References

Schmidt, 1977
Schmidt, W.,
Photoelectron spectra of polynuclear aromatics. V. Correlations with ultraviolet absorption spectra in the catacondensed series,
J. Chem. Phys., 1977, 66, 828. [all data]
Clar and Schmidt, 1975
Clar, E.; Schmidt, W.,
Correlations btween photoelectron and ultraviolet absorption spectra of polycyclic hydrocarbons and the number of aromatic sextets,
Tetrahedron, 1975, 31, 2263. [all data]
Gallegos, 1968
Gallegos, E.J.,
Mass spectrometry and ionization energies of some condensed-ring aromatic and heterocyclic compounds,
J. Phys. Chem., 1968, 72, 3452. [all data]
Briegleb, 1964
Briegleb, G.,
Electron affinity of organic molecules,
Angew. Chem. Intern. Ed., 1964, 3, 617. [all data]
Matsen, 1956
Matsen, F.A.,
Electron affinities, methyl affinities, and ionization energies of condensed ring aromatic hydrocarbons,
J. Chem. Phys., 1956, 24, 602. [all data]