Dibenzo[a,j]naphthacene
- Formula: C26H16
- Molecular weight: 328.4052
- IUPAC Standard InChIKey: KKWNFCVLJZXKCD-UHFFFAOYSA-N
- CAS Registry Number: 227-04-3
- Chemical structure:
View 3d structure (requires JavaScript / HTML 5) - Permanent link for this species. Use this link for bookmarking this species for future reference.

Gas phase ion energetics data

Data compiled as indicated in comments:
LLK - Sharon G. Lias, Rhoda D. Levin, and Sherif A. Kafafi
RDSH - Henry M. Rosenstock, Keith Draxl, Bruce W. Steiner, and John T. Herron
Ionization energy determinations
IE (eV) | Method | Reference | Comment |
---|---|---|---|
6.99 ± 0.02 | PE | Schmidt, 1977 | LLK |
7.02 | PE | Clar and Schmidt, 1975 | LLK |
7.09 | CTS | Briegleb, 1964 | RDSH |
6.82 | CTS | Matsen, 1956 | RDSH |
Appearance energy determinations
Ion | AE (eV) | Other Products | Method | Reference | Comment |
---|---|---|---|---|---|
C26H16+ | 7.02 ± 0.04 | ? | PE | Boschi, Clar, et al., 1974 | LLK |

References

Schmidt, 1977
Schmidt, W.,
Photoelectron spectra of polynuclear aromatics. V. Correlations with ultraviolet absorption spectra in the catacondensed series,
J. Chem. Phys., 1977, 66, 828. [all data]
Clar and Schmidt, 1975
Clar, E.; Schmidt, W.,
Correlations btween photoelectron and ultraviolet absorption spectra of polycyclic hydrocarbons and the number of aromatic sextets,
Tetrahedron, 1975, 31, 2263. [all data]
Briegleb, 1964
Briegleb, G.,
Electron affinity of organic molecules,
Angew. Chem. Intern. Ed., 1964, 3, 617. [all data]
Matsen, 1956
Matsen, F.A.,
Electron affinities, methyl affinities, and ionization energies of condensed ring aromatic hydrocarbons,
J. Chem. Phys., 1956, 24, 602. [all data]
Boschi, Clar, et al., 1974
Boschi, R.; Clar, E.; Schmidt, W.,
Photoelectron spectra of polynuclear aromatics. III. The effect of nonplanarity in sterically overcrowded aromatic hydrocarbons,
J. Chem. Phys., 1974, 60, 4406. [all data]