(Z)-1-Chloro-2-fluoroethene
- Formula: C2H2ClF
- Molecular weight: 80.489
- IUPAC Standard InChIKey: MTKHTBWXSHYCGS-UPHRSURJSA-N
- CAS Registry Number: 2268-31-7
- Chemical structure:
View 3d structure (requires JavaScript / HTML 5) - Stereoisomers:

Reaction thermochemistry data

Data compiled by: Hussein Y. Afeefy, Joel F. Liebman, and Stephen E. Stein
Individual Reactions
By formula: C2H2ClF = C2H2ClF
Quantity | Value | Units | Method | Reference | Comment |
---|---|---|---|---|---|
ΔrH° | -3.6 ± 0.46 | kJ/mol | Eqk | Craig, Piper, et al., 1971 | gas phase |
By formula: C2H2ClF = C2H2ClF
Quantity | Value | Units | Method | Reference | Comment |
---|---|---|---|---|---|
ΔrH° | 3. ± 0.2 | kJ/mol | Eqk | Craig, Piper, et al., 1971 | gas phase |

Gas phase ion energetics data

Data compiled by: Henry M. Rosenstock, Keith Draxl, Bruce W. Steiner, and John T. Herron
Ionization energy determinations
IE (eV) | Method | Reference |
---|---|---|
9.86 ± 0.02 | PI | Momigny, 1963 |
9.87 ± 0.01 | PI | Watanabe, Nakayama, et al., 1962 |

References

Craig, Piper, et al., 1971
Craig, N.C.; Piper, L.G.; Wheeler, V.L.,
Thermodynamics of cis-trans isomerizations. II. The 1-chloro-2-fluoroethylenes, 1,2-difluorocyclopropanes, and related molecules,
J. Phys. Chem., 1971, 75, 1453-1460. [all data]
Momigny, 1963
Momigny, J.,
Ionization potentials and the structures of the photo-ionization yield curves of ethylene and its halogeno derivatives,
Nature, 1963, 199, 1179. [all data]
Watanabe, Nakayama, et al., 1962
Watanabe, K.; Nakayama, T.; Mottl, J.,
Ionization potentials of some molecules,
J. Quant. Spectry. Radiative Transfer, 1962, 2, 369. [all data]