Phenol,2,4,5-trifluoro-
- Formula: C6H3F3O
- Molecular weight: 148.0826
- IUPAC Standard InChIKey: ODGMYCITQAIRCI-UHFFFAOYSA-N
- CAS Registry Number: 2268-16-8
- Chemical structure:
View 3d structure (requires JavaScript / HTML 5) - Other names: 2,4,5-Trifluorophenol

Gas phase ion energetics data

Data compiled by: Sharon G. Lias, Rhoda D. Levin, and Sherif A. Kafafi
Ionization energy determinations
IE (eV) | Method | Reference | Comment |
---|---|---|---|
9.10 ± 0.02 | PE | Maier, Marthaler, et al., 1980 | Vertical value |

References

Maier, Marthaler, et al., 1980
Maier, J.P.; Marthaler, O.; Mohraz, M.,
Emission spectra of the cations of some fluorosubstituted phenols in the gaseous phase,
J. Electron Spectrosc. Relat. Phenom., 1980, 19, 11. [all data]