Spiro[3.3]hepta-1,5-diene
- Formula: C7H8
- Molecular weight: 92.1384
- IUPAC Standard InChIKey: NODMEAHDWHZSNR-UHFFFAOYSA-N
- CAS Registry Number: 22635-78-5
- Chemical structure:
View 3d structure (requires JavaScript / HTML 5) - Other names: Spiro[3.3]hepta-2,5-diene

Gas phase ion energetics data

Data compiled by: Henry M. Rosenstock, Keith Draxl, Bruce W. Steiner, and John T. Herron
Ionization energy determinations
IE (eV) | Method | Reference |
---|---|---|
9.02 | PE | Bodor, Dewar, et al., 1970 |

References

Bodor, Dewar, et al., 1970
Bodor, N.; Dewar, M.J.S.; Worley, S.D.,
Photoelectron spectra of molecules. III. Ionization potentials of some cyclic hydrocarbons and their derivatives, and heats of formation and ionization potentials calculated by the MINDO SCF MO method,
J. Am. Chem. Soc., 1970, 92, 19. [all data]