Cyclohexanone, 2,2-diphenyl-
- Formula: C18H18O
- Molecular weight: 250.3349
- IUPAC Standard InChIKey: VVZQVFCTDWFOOD-UHFFFAOYSA-N
- CAS Registry Number: 22612-62-0
- Chemical structure:
View 3d structure (requires JavaScript / HTML 5) - Permanent link for this species. Use this link for bookmarking this species for future reference.

Gas phase ion energetics data

Data compiled by: Sharon G. Lias, Rhoda D. Levin, and Sherif A. Kafafi
Appearance energy determinations
Ion | AE (eV) | Other Products | Method | Reference | Comment |
---|---|---|---|---|---|
C9H7+ | 14.1 ± 0.4 | ? | EI | Fortin and Rousseau, 1973 | |
C13H9+ | 13.8 ± 0.4 | ? | EI | Fortin and Rousseau, 1973 | |
C14H10+ | 10.7 ± 0.4 | ? | EI | Fortin and Rousseau, 1973 | |
C14H12+ | 9.5 ± 0.4 | ? | EI | Fortin and Rousseau, 1973 | |
C15H13+ | 9.7 ± 0.4 | ? | EI | Fortin and Rousseau, 1973 | |
C16H14+ | 9.6 ± 0.4 | ? | EI | Fortin and Rousseau, 1973 |

References

Fortin and Rousseau, 1973
Fortin, C.J.; Rousseau, Y.,
Spectrometrie de masse des cyclohexanones gem-diphenylees. II. Chaleurs de formation et structures possibles des principaux ions fragmentaires,
Can. J. Chem., 1973, 51, 3457. [all data]