Phosphorodithioic acid, O,S,S-trimethyl ester
- Formula: C3H9O2PS2
- Molecular weight: 172.206
- IUPAC Standard InChIKey: NIJIQSOYZWDHAQ-UHFFFAOYSA-N
- CAS Registry Number: 22608-53-3
- Chemical structure:
View 3d structure (requires JavaScript / HTML 5) - Other names: O,S,S-Trimethyl phosphorodithioate

Gas phase ion energetics data

Data compiled by: Sharon G. Lias, Rhoda D. Levin, and Sherif A. Kafafi
Ionization energy determinations
IE (eV) | Method | Reference |
---|---|---|
9.20 ± 0.10 | EI | Santoro, 1973 |
Appearance energy determinations
Ion | AE (eV) | Other Products | Method | Reference | Comment |
---|---|---|---|---|---|
CH3S+ | 12.60 ± 0.20 | ? | EI | Santoro, 1973 | |
CH4O2P+ | 11.90 ± 0.10 | CH3S+HCHS | EI | Santoro, 1973 | |
C2H6OPS2+ | 10.15 ± 0.10 | CH3O | EI | Santoro, 1973 | |
C2H6O2PS+ | 10.50 ± 0.10 | CH3S | EI | Santoro, 1973 | |
C2H6O2PS2+ | 9.47 ± 0.10 | CH3 | EI | Santoro, 1973 | |
C2H7OPS2+ | 9.90 ± 0.20 | HCHO | EI | Santoro, 1973 | |
C2H7O2PS+ | 10.10 ± 0.10 | HCHS | EI | Santoro, 1973 |

References

Santoro, 1973
Santoro, E.,
The fragmentation of some alkyl thiophosphate esters by electron-impact,
Org. Mass Spectrom., 1973, 7, 589. [all data]