1,2-Pentadiene, 3-(1,1-dimethylethyl)-4,4-dimethyl-
- Formula: C11H20
- Molecular weight: 152.2765
- IUPAC Standard InChIKey: CMFCUMMNLOPFCC-UHFFFAOYSA-N
- CAS Registry Number: 22585-31-5
- Chemical structure:
View 3d structure (requires JavaScript / HTML 5) - Permanent link for this species. Use this link for bookmarking this species for future reference.

Gas phase ion energetics data

Data compiled as indicated in comments:
LLK - Sharon G. Lias, Rhoda D. Levin, and Sherif A. Kafafi
Ionization energy determinations
IE (eV) | Method | Reference | Comment |
---|---|---|---|
8.55 | PE | Brogli, Crandall, et al., 1973 | Vertical value; LLK |

References

Brogli, Crandall, et al., 1973
Brogli, F.; Crandall, J.K.; Heilbronner, E.; Kloster-Jensen, E.; Sojka, S.A.,
The photoelectron spectra of methyl-substituted allenes and of tetramethyl-bisallenyl,
J. Electron Spectrosc. Relat. Phenom., 1973, 2, 455. [all data]