Pyridine, 4-(methylthio)-
- Formula: C6H7NS
- Molecular weight: 125.191
- IUPAC Standard InChIKey: XCHSSZMKKXPBAI-UHFFFAOYSA-N
- CAS Registry Number: 22581-72-2
- Chemical structure:
View 3d structure (requires JavaScript / HTML 5) - Other names: 4-(Methylthio)pyridine

Phase change data

Data compiled by: William E. Acree, Jr., James S. Chickos
Enthalpy of vaporization
ΔvapH (kJ/mol) | Temperature (K) | Method | Reference | Comment |
---|---|---|---|---|
55.8 | 361. | A | Stephenson and Malanowski, 1987 | Based on data from 346. to 383. K. |
Enthalpy of sublimation
ΔsubH (kJ/mol) | Temperature (K) | Method | Reference | Comment |
---|---|---|---|---|
75.3 ± 3.8 | 365. | B | Beak, Mueller, et al., 1974 | Based on data from 347. to 383. K. |

Reaction thermochemistry data

Data compiled by: Hussein Y. Afeefy, Joel F. Liebman, and Stephen E. Stein
Individual Reactions
By formula: C6H7NS = C6H7NS
Quantity | Value | Units | Method | Reference | Comment |
---|---|---|---|---|---|
ΔrH° | -2. ± 5.0 | kJ/mol | Ciso | Beak, Mueller, et al., 1974 | liquid phase; solvent: 1,2-Dichloroethane; #LED |
ΔrH° | -117. ± 16. | kJ/mol | Ciso | Beak, Mueller, et al., 1974 | gas phase; Hr gas phase |

Gas phase ion energetics data

Data evaluated as indicated in comments:
HL - Edward P. Hunter and Sharon G. Lias
Data compiled as indicated in comments:
LLK - Sharon G. Lias, Rhoda D. Levin, and Sherif A. Kafafi
Quantity | Value | Units | Method | Reference | Comment |
---|---|---|---|---|---|
Proton affinity (review) | 955.2 | kJ/mol | N/A | Hunter and Lias, 1998 | HL |
Quantity | Value | Units | Method | Reference | Comment |
Gas basicity | 923.3 | kJ/mol | N/A | Hunter and Lias, 1998 | HL |
Ionization energy determinations
IE (eV) | Method | Reference | Comment |
---|---|---|---|
9.00 ± 0.02 | EI | Gronneberg and Undheim, 1972 | LLK |
8.73 ± 0.03 | PE | Cook, El-Abbady, et al., 1977 | Vertical value; LLK |

Van Den Dool and Kratz RI, polar column, temperature ramp

View large format table.

Column type Active phase I Reference Comment
CapillaryDB-Wax1796.Shimoda, Shiratsuchi, et al., 199660. m/0.25 mm/0.25 μm, He, 2. K/min, 230. C @ 60. min; Tstart: 50. C

References

Stephenson and Malanowski, 1987
Stephenson, Richard M.; Malanowski, Stanislaw,
Handbook of the Thermodynamics of Organic Compounds, 1987, https://doi.org/10.1007/978-94-009-3173-2
. [all data]
Beak, Mueller, et al., 1974
Beak, P.; Mueller, D.S.; Lee, J.,
Equilibration studies. Determination of the enthalpy difference between methyltropic isomers from heats of methylation,
J. Am. Chem. Soc., 1974, 96, 3867-3874. [all data]
Hunter and Lias, 1998
Hunter, E.P.; Lias, S.G.,
Evaluated Gas Phase Basicities and Proton Affinities of Molecules: An Update,
J. Phys. Chem. Ref. Data, 1998, 27, 3, 413-656, https://doi.org/10.1063/1.556018
. [all data]
Gronneberg and Undheim, 1972
Gronneberg, T.; Undheim, K.,
Mass spectrometry of onium compounds. XI: ionization potentials of hydroxy and mercapto pyridines,
Org. Mass Spectrom., 1972, 6, 823. [all data]
Cook, El-Abbady, et al., 1977
Cook, M.J.; El-Abbady, S.; Katritzky, A.R.; Guimon, C.; Pfister-Guillouzo, G.,
Photoelectron spectra of hydroxy- and mercapto-pyridines and models of fixed structure,
J. Chem. Soc. Perkin Trans. 2, 1977, 1652. [all data]