Hydrazine, (1-methylethyl)-
- Formula: C3H10N2
- Molecular weight: 74.1249
- IUPAC Standard InChIKey: KJAQRHMKLVGSCG-UHFFFAOYSA-N
- CAS Registry Number: 2257-52-5
- Chemical structure:
View 3d structure (requires JavaScript / HTML 5) - Permanent link for this species. Use this link for bookmarking this species for future reference.

Gas phase ion energetics data

Data compiled by: Sharon G. Lias, Rhoda D. Levin, and Sherif A. Kafafi
Ionization energy determinations
IE (eV) | Method | Reference | Comment |
---|---|---|---|
8.42 ± 0.05 | PE | Vovna, Vilesov, et al., 1975 | |
9.05 | PE | Nelsen and Buschek, 1974 | Vertical value |

References

Vovna, Vilesov, et al., 1975
Vovna, V.I.; Vilesov, F.I.; Lopatin, S.N.,
Photoelectron spectra of hydrazine and some alkyl derivatives,
Opt. Spectrosc., 1975, 38, 143. [all data]
Nelsen and Buschek, 1974
Nelsen, S.F.; Buschek, J.M.,
Photoelectron spectra of hydrazines. III. Evidence for similar lone pair-lone pair dihedral angles for acyclic hydrazines,
J. Am. Chem. Soc., 1974, 96, 2392. [all data]