p-methylphenethyl acetate
- Formula: C11H14O2
- Molecular weight: 178.2277
- IUPAC Standard InChIKey: SQLIRIQAWQKBFY-UHFFFAOYSA-N
- CAS Registry Number: 22532-47-4
- Chemical structure:
View 3d structure (requires JavaScript / HTML 5) - Other names: Benzeneethanol, 4-methyl-, acetate

Gas phase ion energetics data

Data compiled by: Sharon G. Lias, Rhoda D. Levin, and Sherif A. Kafafi
Appearance energy determinations
Ion | AE (eV) | Other Products | Method | Reference | Comment |
---|---|---|---|---|---|
C2H3O+ | 11.90 | ? | EI | Audier, Bouchoux, et al., 1971 | |
C8H9+ | 11.80 | ? | EI | Audier, Bouchoux, et al., 1971 | |
C9H10+ | 8.50 | ? | EI | Audier, Bouchoux, et al., 1971 |

References

Audier, Bouchoux, et al., 1971
Audier, H.E.; Bouchoux, G.; Fetizon, M.,
Ionisation et fragmentation en spectrometrie de masse. II. Influence du substituant sur des fragmentations competitives en serie aromatique,
Bull. Soc. Chim. Fr., 1971, 3, 858. [all data]