Pentafluoroaniline, TMS derivative
- Formula: C9H10F5NSi
- Molecular weight: 255.2599
- IUPAC Standard InChIKey: KWEFNENVOXDWHP-UHFFFAOYSA-N
- CAS Registry Number: 22529-97-1
- Chemical structure:
View 3d structure (requires JavaScript / HTML 5) - Other names: Silanamine, 1,1,1-trimethyl-N-(pentafluorophenyl)-

Gas phase ion energetics data

Data compiled by: Sharon G. Lias, John E. Bartmess, Joel F. Liebman, John L. Holmes, Rhoda D. Levin, and W. Gary Mallard
Ionization energy determinations
IE (eV) | Method | Reference | Comment |
---|---|---|---|
8.90 | PE | Furin, Sultanov, et al., 1987 | Vertical value |

References

Furin, Sultanov, et al., 1987
Furin, G.G.; Sultanov, A.S.; Furlei, I.I.,
Photoelectronic spectra of fluorine-containing aromatic amines,
Dokl. Phys. Chem., 1987, 530. [all data]
(editor), 1980
(editor), Koptyug V.A.,
Atlas of Spectra of Aromatic and Heterocyclic Compounds, 1980, 18, 20. [all data]