Pentafluorobenzoyl chloride
- Formula: C7ClF5O
- Molecular weight: 230.519
- IUPAC Standard InChIKey: MYHOHFDYWMPGJY-UHFFFAOYSA-N
- CAS Registry Number: 2251-50-5
- Chemical structure:
View 3d structure (requires JavaScript / HTML 5) - Other names: 2,3,4,5,6-Pentafluorobenzoyl chloride; Benzoyl chloride, pentafluoro-; Pentafluorobenzyl chloride

Gas phase ion energetics data

Data compiled as indicated in comments:
LLK - Sharon G. Lias, Rhoda D. Levin, and Sherif A. Kafafi
Ionization energy determinations
IE (eV) | Method | Reference | Comment |
---|---|---|---|
9.8 | PE | Meeks, Wahlborg, et al., 1981 | LLK |
10.2 | PE | Meeks, Wahlborg, et al., 1981 | Vertical value; LLK |

References

Meeks, Wahlborg, et al., 1981
Meeks, J.; Wahlborg, A.; McGlynn, S.P.,
Photoelectron spectroscopy of carbonyls: Benzoic acid and its derivatives,
J. Electron Spectrosc. Relat. Phenom., 1981, 22, 43. [all data]