Aminoacetaldehyde dimethyl acetal
- Formula: C4H11NO2
- Molecular weight: 105.1356
- IUPAC Standard InChIKey: QKWWDTYDYOFRJL-UHFFFAOYSA-N
- CAS Registry Number: 22483-09-6
- Chemical structure:
View 3d structure (requires JavaScript / HTML 5) - Other names: Ethanamine, 2,2-dimethoxy-; Acetaldehyde, amino-, dimethyl acetal; 2,2-Dimethoxyethanamine; 2,2-Dimethoxyethylamine

Phase change data

Data compiled by: Robert L. Brown and Stephen E. Stein
Quantity | Value | Units | Method | Reference | Comment |
---|---|---|---|---|---|
Tboil | 409. | K | N/A | American Tokyo Kasei, 1988 |
Reduced pressure boiling point
Tboil (K) | Pressure (bar) | Reference |
---|---|---|
410.2 | 0.13 | Weast and Grasselli, 1989 |

Gas phase ion energetics data

Data compiled by: Sharon G. Lias, John E. Bartmess, Joel F. Liebman, John L. Holmes, Rhoda D. Levin, and W. Gary Mallard
Appearance energy determinations
Ion | AE (eV) | Other Products | Method | Reference | Comment |
---|---|---|---|---|---|
CH4N+ | 9.46 ± 0.05 | (CH30)2CH | EI | Holmes and Lossing, 1984 |

References

American Tokyo Kasei, 1988
American Tokyo Kasei,
TCI American Organic Chemical 88/89 Catalog, American Tokyo Kasei, Portland, OR, 1988, 1610. [all data]
Weast and Grasselli, 1989
CRC Handbook of Data on Organic Compounds, 2nd Editon, Weast,R.C and Grasselli, J.G., ed(s)., CRC Press, Inc., Boca Raton, FL, 1989, 1. [all data]
Holmes and Lossing, 1984
Holmes, J.L.; Lossing, F.P.,
Heats of formation of organic radicals from appearance energies,
Int. J. Mass Spectrom. Ion Processes, 1984, 58, 113. [all data]