3,3-Dimethyl-1,2-epoxybutane
- Formula: C6H12O
- Molecular weight: 100.1589
- IUPAC Standard InChIKey: HEAYDCIZOFDHRM-UHFFFAOYSA-N
- CAS Registry Number: 2245-30-9
- Chemical structure:
View 3d structure (requires JavaScript / HTML 5) - Other names: Oxirane, (1,1-dimethylethyl)-; tert-Butylethylene oxide; tert-Butyloxirane; Butane, 1,2-epoxy-3,3-dimethyl-; 2-tert-Butyloxirane; 3,3-Dimethylbutene oxide; Oxirane, 2-(1,1-dimethylethyl)-; 1,1-Dimethylethyl-oxirane

Phase change data

Data compiled by: Thermodynamics Research Center, NIST Boulder Laboratories, Chris Muzny director
Quantity | Value | Units | Method | Reference | Comment |
---|---|---|---|---|---|
Tboil | 374.47 | K | N/A | Van Risseghem, 1952 | Uncertainty assigned by TRC = 0.5 K |
Tboil | 380.15 | K | N/A | Fourneau and Tiffeneau, 1907 | Uncertainty assigned by TRC = 2. K |
Tboil | 379.15 | K | N/A | Friedel and Silva, 1873 | Uncertainty assigned by TRC = 3. K |

Gas phase ion energetics data

Data compiled by: Sharon G. Lias and Joel F. Liebman
Ionization energy determinations
IE (eV) | Method | Reference | Comment |
---|---|---|---|
10.04 ± 0.05 | PE | Block, Yencha, et al., 1988 | Vertical value |

Normal alkane RI, non-polar column, temperature ramp

Column type | Active phase | I | Reference | Comment |
---|---|---|---|---|
Capillary | OV-101 | 705. | Zenkevich, 2005 | 25. m/0.20 mm/0.10 μm, N2/He, 6. K/min; Tstart: 50. C; Tend: 250. C |

Normal alkane RI, non-polar column, custom temperature program

Column type | Active phase | I | Reference | Comment |
---|---|---|---|---|
Capillary | Methyl Silicone | 705. | Farkas, Héberger, et al., 2004 | Program: not specified |

References

Van Risseghem, 1952
Van Risseghem, H.,
3-Methyl-3-pentene,
Bull. Soc. Chim. Fr., 1952, 1952, 177. [all data]
Fourneau and Tiffeneau, 1907
Fourneau; Tiffeneau,
C. R. Hebd. Seances Acad. Sci., 1907, 145, 437. [all data]
Friedel and Silva, 1873
Friedel, C.; Silva, R.D.,
C. R. Hebd. Seances Acad. Sci., 1873, 76, 226. [all data]
Block, Yencha, et al., 1988
Block, E.; Yencha, A.J.; Aslam, M.; Eswarakrishnan, V.; Luo, J.; Sano, A.,
Gas-phase determination of the geometric requirements of the silicon B-effect. Photoelectron and penning ionization electron spectroscopic study of silylthiiranes and -oxiranes. Synthesis and chemistry of trans-2,3-bis(trimethylsilyl)thiirane,
J. Am. Chem. Soc., 1988, 110, 4748. [all data]
Zenkevich, 2005
Zenkevich, I.G.,
Experimentally measured retention indices., 2005. [all data]
Farkas, Héberger, et al., 2004
Farkas, O.; Héberger, K.; Zenkevich, I.G.,
Quantitative structure-retention relationships. XIV. Prediction of gas chromatographic retention indices for saturated O-, N-, and S-heterocyclic compounds,
Chemom. Intell. Lab. Syst., 2004, 72, 2, 173-184, https://doi.org/10.1016/j.chemolab.2004.01.012
. [all data]