Methanone, (2-nitrophenyl)phenyl-
- Formula: C13H9NO3
- Molecular weight: 227.2155
- IUPAC Standard InChIKey: UJHSIDUUJPTLDY-UHFFFAOYSA-N
- CAS Registry Number: 2243-79-0
- Chemical structure:
View 3d structure (requires JavaScript / HTML 5) - Permanent link for this species. Use this link for bookmarking this species for future reference.

Gas phase ion energetics data

Data compiled by: Sharon G. Lias, Rhoda D. Levin, and Sherif A. Kafafi
Ionization energy determinations
IE (eV) | Method | Reference |
---|---|---|
9.6 ± 0.1 | EI | Krenmayr, Heller, et al., 1974 |
9.6 ± 0.1 | EI | Heller, Varmuza, et al., 1974 |
Appearance energy determinations
Ion | AE (eV) | Other Products | Method | Reference | Comment |
---|---|---|---|---|---|
C6H5+ | 14.9 ± 0.3 | ? | EI | Krenmayr, Heller, et al., 1974 | |
C7H4NO2+ | 10.3 ± 0.1 | ? | EI | Krenmayr, Heller, et al., 1974 | |
C7H4NO3+ | 12.0 ± 0.2 | ? | EI | Krenmayr, Heller, et al., 1974 | |
C7H4NO3+ | 12.0 ± 0.2 | ? | EI | Heller, Varmuza, et al., 1974 | |
C7H5O+ | 11.1 ± 0.1 | ? | EI | Krenmayr, Heller, et al., 1974 |

References

Krenmayr, Heller, et al., 1974
Krenmayr, P.; Heller, R.; Varmuza, K.,
Massenspektrometrische untersuchungen an benzophenon und substituierten benzophenonen. I. Ermittlung thermodynamischer grossen,
Org. Mass Spectrom., 1974, 9, 998. [all data]
Heller, Varmuza, et al., 1974
Heller, R.; Varmuza, K.; Krenmayr, P.,
Massenspektrometrische untersuchung des substituenteneffektes bei einfach substituierten benzophenonen,
Monatsh. Chem., 1974, 105, 787. [all data]