1,2-Dioxolane,3,3,5,5-tetramethyl-
- Formula: C7H14O2
- Molecular weight: 130.1849
- IUPAC Standard InChIKey: MUAPWBKCTHUXLT-UHFFFAOYSA-N
- CAS Registry Number: 22431-90-9
- Chemical structure:
View 3d structure (requires JavaScript / HTML 5) - Permanent link for this species. Use this link for bookmarking this species for future reference.

Gas phase ion energetics data

Data compiled as indicated in comments:
LLK - Sharon G. Lias, Rhoda D. Levin, and Sherif A. Kafafi
Ionization energy determinations
IE (eV) | Method | Reference | Comment |
---|---|---|---|
9.26 | PE | Brown, 1975 | Vertical value; LLK |
9.25 | PE | Batich and Adam, 1974 | Vertical value; LLK |

References

Brown, 1975
Brown, R.S.,
A photoelectron investigation of the peroxide bond,
Can. J. Chem., 1975, 53, 3439. [all data]
Batich and Adam, 1974
Batich, C.; Adam, W.,
The photoelectron spectra of alkylperoxides,
Tetrahedron Lett., 1974, 1467. [all data]