1,2-Dioxane, 3,3,6,6-tetramethyl-
- Formula: C8H16O2
- Molecular weight: 144.2114
- IUPAC Standard InChIKey: KWGQMMAUPVIDIG-UHFFFAOYSA-N
- CAS Registry Number: 22431-89-6
- Chemical structure:
View 3d structure (requires JavaScript / HTML 5) - Other names: 3,3,6,6-Tetramethyl-1,2-dioxacyclohexane

Gas phase ion energetics data

Data compiled as indicated in comments:
LLK - Sharon G. Lias, Rhoda D. Levin, and Sherif A. Kafafi
Ionization energy determinations
IE (eV) | Method | Reference | Comment |
---|---|---|---|
9.35 | PE | Brown, 1975 | Vertical value; LLK |
9.55 | PE | Batich and Adam, 1974 | Vertical value; LLK |

References

Brown, 1975
Brown, R.S.,
A photoelectron investigation of the peroxide bond,
Can. J. Chem., 1975, 53, 3439. [all data]
Batich and Adam, 1974
Batich, C.; Adam, W.,
The photoelectron spectra of alkylperoxides,
Tetrahedron Lett., 1974, 1467. [all data]