(E,E)-3,5-Octadiene, 2,2,7,7-tetramethyl-
- Formula: C12H22
- Molecular weight: 166.3031
- IUPAC Standard InChIKey: CWNHIRCWNQMGEU-FIFLTTCUSA-N
- CAS Registry Number: 22430-49-5
- Chemical structure:
View 3d structure (requires JavaScript / HTML 5) - Permanent link for this species. Use this link for bookmarking this species for future reference.

Gas phase ion energetics data

Data compiled as indicated in comments:
RDSH - Henry M. Rosenstock, Keith Draxl, Bruce W. Steiner, and John T. Herron
Ionization energy determinations
IE (eV) | Method | Reference | Comment |
---|---|---|---|
8.23 ± 0.04 | EI | Bock and Seidl, 1968 | RDSH |

References

Bock and Seidl, 1968
Bock, H.; Seidl, H.,
'd-Orbital effects' in silicon- substituted π-electron systems. XI. Syntheses and properties of the isomeric bis(trimethylsilyl)-1,3-butadienes,
J. Am. Chem. Soc., 1968, 90, 5694. [all data]