Phosphite, tris(2,2,3,3-tetrafluoropropyl)-
- Formula: C9H9F12O3P
- Molecular weight: 424.1206
- IUPAC Standard InChIKey: PUZURCZFQYUHAC-UHFFFAOYSA-N
- CAS Registry Number: 2241-68-1
- Chemical structure:
View 3d structure (requires JavaScript / HTML 5) - Permanent link for this species. Use this link for bookmarking this species for future reference.

Gas phase ion energetics data

Data compiled by: Sharon G. Lias and Joel F. Liebman
Ionization energy determinations
IE (eV) | Method | Reference | Comment |
---|---|---|---|
10.18 | PE | Zverev, Sinyashina, et al., 1990 | Vertical value |

References

Zverev, Sinyashina, et al., 1990
Zverev, V.V.; Sinyashina, T.N.; Mironov, V.F.,
Photoelectron spectra and electronic structures of organophosphorus compounds. IX. Fluorine-containing phosphites,
J. Gen. Chem. USSR, 1990, 60, 696. [all data]