Tricyclo[3.2.1.02,4]octane,(1α,2α,4α,5α)-
- Formula: C8H12
- Molecular weight: 108.1809
- IUPAC Standard InChIKey: PSZPCAFRANQPLS-XUTVFYLZSA-N
- CAS Registry Number: 22389-16-8
- Chemical structure:
View 3d structure (requires JavaScript / HTML 5) - Species with the same structure:
- Stereoisomers:

Gas phase ion energetics data

Data compiled as indicated in comments:
LLK - Sharon G. Lias, Rhoda D. Levin, and Sherif A. Kafafi
RDSH - Henry M. Rosenstock, Keith Draxl, Bruce W. Steiner, and John T. Herron
Ionization energy determinations
IE (eV) | Method | Reference | Comment |
---|---|---|---|
8.8 ± 0.1 | EI | Brion, Farmer, et al., 1970 | RDSH |
9.40 | PE | Bischof, Heilbronner, et al., 1971 | Vertical value; LLK |

References

Brion, Farmer, et al., 1970
Brion, C.E.; Farmer, J.S.H.; Pincock, R.E.; Stewart, W.B.,
Mass spectra of some geometric isomers at 1216 Å and 584 Å : The photoionization of isomeric tricyclo[3.2.1.02,4]octanes and related compounds,
Org. Mass Spectrom., 1970, 4, 587. [all data]
Bischof, Heilbronner, et al., 1971
Bischof, P.; Heilbronner, E.; Prinzbach, H.; Martin, H.D.,
A photoelectron-spectroscopic investigation of the homoconjugative interaction between π- and Walsh-orbitals in endo- and exo- cyclopropano-norbornene,
Helv. Chim. Acta, 1971, 54, 1072. [all data]