2-Pentanone, 5-phenyl-
- Formula: C11H14O
- Molecular weight: 162.2283
- IUPAC Standard InChIKey: DGMYRPFYNFQCHM-UHFFFAOYSA-N
- CAS Registry Number: 2235-83-8
- Chemical structure:
View 3d structure (requires JavaScript / HTML 5) - Other names: Methyl 3-phenylpropyl ketone; 5-Phenyl-2-pentanone; 5-phenylpentan-2-one

Gas phase ion energetics data

Data compiled by: Henry M. Rosenstock, Keith Draxl, Bruce W. Steiner, and John T. Herron
Ionization energy determinations
IE (eV) | Method | Reference |
---|---|---|
9.0 ± 0.1 | EI | Occolowitz, 1967 |
Appearance energy determinations
Ion | AE (eV) | Other Products | Method | Reference | Comment |
---|---|---|---|---|---|
C8H8+ | 9.6 ± 0.2 | CH2C(CH3)OH | EI | Occolowitz, 1967 |

Van Den Dool and Kratz RI, polar column, temperature ramp

Column type | Active phase | I | Reference | Comment |
---|---|---|---|---|
Capillary | CP-WAX 57CB | 1942. | Baltes and Mevissen, 1988 | He, 50. C @ 5. min, 2. K/min; Column length: 50. m; Column diameter: 0.24 mm; Tend: 210. C |

References

Occolowitz, 1967
Occolowitz, J.L.,
Charge localization and the electronimpact fragmentation of carbonyl compounds,
Australian J. Chem., 1967, 20, 2387. [all data]