1,3,5-Hexatriene
- Formula: C6H8
- Molecular weight: 80.1277
- IUPAC Standard InChIKey: AFVDZBIIBXWASR-UHFFFAOYSA-N
- CAS Registry Number: 2235-12-3
- Chemical structure:
View 3d structure (requires JavaScript / HTML 5) - Stereoisomers:
- Other names: Hexa-1,3,5-triene; Hexatriene; Divinylethylene; hexa-1,3,5-triene, mixed isomers

Phase change data

Data compiled as indicated in comments:
BS - Robert L. Brown and Stephen E. Stein
TRC - Thermodynamics Research Center, NIST Boulder Laboratories, Chris Muzny director
Quantity | Value | Units | Method | Reference | Comment |
---|---|---|---|---|---|
Tboil | 353. ± 3. | K | AVG | N/A | Average of 14 values; Individual data points |
Quantity | Value | Units | Method | Reference | Comment |
Tfus | 261.45 | K | N/A | Woods and Schwartzman, 1948 | Uncertainty assigned by TRC = 0.3 K; TRC |

Gas phase ion energetics data

Data compiled by: Henry M. Rosenstock, Keith Draxl, Bruce W. Steiner, and John T. Herron
Ionization energy determinations
IE (eV) | Method | Reference |
---|---|---|
8.42 ± 0.05 | EI | Franklin and Carroll, 1969 |
8.27 ± 0.05 | S | Price, 1946 |
Appearance energy determinations
Ion | AE (eV) | Other Products | Method | Reference | Comment |
---|---|---|---|---|---|
C4H2+ | 16.46 ± 0.15 | C2H2+2H2 | EI | Franklin and Carroll, 1969 | |
C4H3+ | 16.54 ± 0.15 | C2H2+H2+H? | EI | Franklin and Carroll, 1969 | |
C4H4+ | 12.82 ± 0.10 | C2H2+H2 | EI | Franklin and Carroll, 1969 | |
C4H5+ | 13.60 ± 0.10 | C2H2+H | EI | Franklin and Carroll, 1969 | |
C4H6+ | 12.25 ± 0.30 | C2H2 | EI | Franklin and Carroll, 1969 | |
C5H3+ | 14.95 ± 0.15 | CH3+H2? | EI | Franklin and Carroll, 1969 | |
C5H5+ | 12.25 ± 0.10 | CH3 | EI | Franklin and Carroll, 1969 | |
C6H5+ | 13.11 ± 0.10 | H2+H | EI | Franklin and Carroll, 1969 | |
C6H6+ | 10.77 ± 0.10 | H2 | EI | Franklin and Carroll, 1969 | |
C6H7+ | 9.96 ± 0.15 | H | EI | Franklin and Carroll, 1969 |

Kovats' RI, non-polar column, isothermal

Column type | Active phase | Temperature (C) | I | Reference | Comment |
---|---|---|---|---|---|
Capillary | SE-30 | 130. | 648. | Bredael, 1982 | Column length: 100. m; Column diameter: 0.5 mm |
Capillary | SE-30 | 80. | 647. | Bredael, 1982 | Column length: 100. m; Column diameter: 0.5 mm |

Van Den Dool and Kratz RI, non-polar column, temperature ramp

Column type | Active phase | I | Reference | Comment |
---|---|---|---|---|
Capillary | Petrocol DH | 629. | White, Hackett, et al., 1992 | 100. m/0.25 mm/0.5 μm, He, 1. K/min; Tstart: 30. C; Tend: 220. C |

References

Woods and Schwartzman, 1948
Woods, G.F.; Schwartzman, L.H.,
1,3,5-Hexatriene,
J. Am. Chem. Soc., 1948, 70, 3394. [all data]
Franklin and Carroll, 1969
Franklin, J.L.; Carroll, S.R.,
Effect of molecular structure on ionic decomposition. II. An electron-impact study of 1,3-and 1,4-cyclohexadiene and 1,3,5-hexatriene,
J. Am. Chem. Soc., 1969, 91, 6564. [all data]
Price, 1946
Price, W.C.,
The absorption spectra of hexatriene and divinyl acetylene in the vacuum ultraviolet,
Proc. Roy. Soc. (London) Al, 1946, 85, 182. [all data]
Bredael, 1982
Bredael, P.,
Retention indices of hydrocarbons on SE-30,
J. Hi. Res. Chromatogr. Chromatogr. Comm., 1982, 5, 6, 325-328, https://doi.org/10.1002/jhrc.1240050610
. [all data]
White, Hackett, et al., 1992
White, C.M.; Hackett, J.; Anderson, R.R.; Kail, S.; Spock, P.S.,
Linear temperature programmed retention indices of gasoline range hydrocarbons and chlorinated hydrocarbons on cross-linked polydimethylsiloxane,
J. Hi. Res. Chromatogr., 1992, 15, 2, 105-120, https://doi.org/10.1002/jhrc.1240150211
. [all data]